1-Chloroundecane
- Formula: C11H23Cl
- Molecular weight: 190.753
- IUPAC Standard InChIKey: ZHKKNUKCXPWZOP-UHFFFAOYSA-N
- CAS Registry Number: 2473-03-2
- Chemical structure:
View 3d structure (requires JavaScript / HTML 5) - Other names: n-Undecyl chloride; Undecane, 1-chloro-; Undecyl chloride

Phase change data

Data compiled as indicated in comments:
AC - William E. Acree, Jr., James S. Chickos
Quantity | Value | Units | Method | Reference | Comment |
---|---|---|---|---|---|
ΔvapH° | 70.2 | kJ/mol | N/A | Bolotnikov and Neruchev, 2006 | AC |
ΔvapH° | 65.9 | kJ/mol | N/A | Boublik, Fried, et al., 1984 | Based on data from 370. to 520. K. See also Basarová and Svoboda, 1991.; AC |
Enthalpy of vaporization
ΔvapH (kJ/mol) | Temperature (K) | Method | Reference | Comment |
---|---|---|---|---|
59.4 | 389. | A,DTA | Stephenson and Malanowski, 1987 | Based on data from 374. to 519. K. See also Kemme and Kreps, 1969.; AC |
Antoine Equation Parameters
log10(P) = A − (B / (T + C))
P = vapor pressure (bar)
T = temperature (K)
View plot Requires a JavaScript / HTML 5 canvas capable browser.
Temperature (K) | A | B | C | Reference |
---|---|---|---|---|
374.6 to 518.6 | 4.09739 | 1713.225 | -99.784 | Kemme and Kreps, 1969 |

Kovats' RI, polar column, isothermal

Column type | Active phase | Temperature (C) | I | Reference | Comment |
---|---|---|---|---|---|
Packed | PEG-20M | 130. | 1561. | Jaworski and Zolna, 1982 | Chromosorb W; Column length: 2.8 m |

Kovats' RI, polar column, temperature ramp

Column type | Active phase | I | Reference | Comment |
---|---|---|---|---|
Packed | PEG-20M | 1561. | Jaworski and Zolna, 1982 | Chromosorb W, 6. K/min; Column length: 2.8 m; Tstart: 110. C; Tend: 200. C |

Van Den Dool and Kratz RI, non-polar column, temperature ramp

Column type | Active phase | I | Reference | Comment |
---|---|---|---|---|
Capillary | Petrocol DH | 1358. | White, Hackett, et al., 1992 | 100. m/0.25 mm/0.5 μm, He, 1. K/min; Tstart: 30. C; Tend: 220. C |

Normal alkane RI, non-polar column, isothermal

Column type | Active phase | Temperature (C) | I | Reference | Comment |
---|---|---|---|---|---|
Capillary | Apiezon L | 130. | 1365. | Arruda, Junkes, et al., 2008 |

References

Bolotnikov and Neruchev, 2006
Bolotnikov, M.F.; Neruchev, Yu.A.,
The enthalpies of vaporization and intermolecular interaction energies of 1-chloroalkanes,
Russ. J. Phys. Chem., 2006, 80, 8, 1191-1197, https://doi.org/10.1134/S0036024406080024
. [all data]
Boublik, Fried, et al., 1984
Boublik, T.; Fried, V.; Hala, E.,
The Vapour Pressures of Pure Substances: Selected Values of the Temperature Dependence of the Vapour Pressures of Some Pure Substances in the Normal and Low Pressure Region, 2nd ed., Elsevier, New York, 1984, 972. [all data]
Basarová and Svoboda, 1991
Basarová, Pavlína; Svoboda, Václav,
Calculation of heats of vaporization of halogenated hydrocarbons from saturated vapour pressure data,
Fluid Phase Equilibria, 1991, 68, 13-34, https://doi.org/10.1016/0378-3812(91)85008-I
. [all data]
Stephenson and Malanowski, 1987
Stephenson, Richard M.; Malanowski, Stanislaw,
Handbook of the Thermodynamics of Organic Compounds, 1987, https://doi.org/10.1007/978-94-009-3173-2
. [all data]
Kemme and Kreps, 1969
Kemme, Herbert R.; Kreps, Saul I.,
Vapor pressure of primary n-alkyl chlorides and alcohols,
J. Chem. Eng. Data, 1969, 14, 1, 98-102, https://doi.org/10.1021/je60040a011
. [all data]
Jaworski and Zolna, 1982
Jaworski, M.; Zolna, H.,
Oznaczanie alkanów, monochloroalkanów i polichloroalkanów metoda chromatografii gazowej,
Chem. Anal. (Warsaw), 1982, 27, 97-105. [all data]
White, Hackett, et al., 1992
White, C.M.; Hackett, J.; Anderson, R.R.; Kail, S.; Spock, P.S.,
Linear temperature programmed retention indices of gasoline range hydrocarbons and chlorinated hydrocarbons on cross-linked polydimethylsiloxane,
J. Hi. Res. Chromatogr., 1992, 15, 2, 105-120, https://doi.org/10.1002/jhrc.1240150211
. [all data]
Arruda, Junkes, et al., 2008
Arruda, A.C.S.; Junkes, B. da.S.; Souza, E.S.; Yunes, R.A.; Heizen, V.E.F.,
Semi-Emlirical Topological Index to Predict Properties of Halogenated Aliphatic Compounds,
J. Chemometrics, 2008, 22, 3-4, 186-194, https://doi.org/10.1002/cem.1121
. [all data]