3-(Decylthio)-1,2-propanediol
- Formula: C13H28O2S
- Molecular weight: 248.425
- IUPAC Standard InChIKey: ZCTCMSMNMSTPIV-UHFFFAOYSA-N
- CAS Registry Number: 24724-30-9
- Chemical structure:
View 3d structure (requires JavaScript / HTML 5) - Permanent link for this species. Use this link for bookmarking this species for future reference.

Phase change data

Data compiled as indicated in comments:
TRC - Thermodynamics Research Center, NIST Boulder Laboratories, Chris Muzny director
AC - William E. Acree, Jr., James S. Chickos
Quantity | Value | Units | Method | Reference | Comment |
---|---|---|---|---|---|
Tfus | 311.9 | K | N/A | van Doren and van der Geest, 1990 | Crystal phase 1 phase; Uncertainty assigned by TRC = 1. K; TRC |
Enthalpy of fusion
ΔfusH (kJ/mol) | Temperature (K) | Method | Reference | Comment |
---|---|---|---|---|
17.3 | 311.9 | DSC | Acree, 1993 | AC |

References

van Doren and van der Geest, 1990
van Doren, H.A.; van der Geest, R.,
A comparative study of the liquid-crystalline behavior of three homologous series of 1,2-propanediol derivatives,
Recl.: J. R. Neth. Chem. Soc., 1990, 109, 197. [all data]
Acree, 1993
Acree, William E.,
Thermodynamic properties of organic compounds,
Thermochimica Acta, 1993, 219, 97-104, https://doi.org/10.1016/0040-6031(93)80486-T
. [all data]