Dicapthon
- Formula: C8H9ClNO5PS
- Molecular weight: 297.653
- IUPAC Standard InChIKey: OTKXWJHPGBRXCR-UHFFFAOYSA-N
- CAS Registry Number: 2463-84-5
- Chemical structure:
View 3d structure (requires JavaScript / HTML 5) - Other names: Phosphorothioic acid, O-(2-chloro-4-nitrophenyl) O,O-dimethyl ester; p-Nitro-o-chlorophenyl dimethyl thionophosphate; American Cyanamid 4124; BAY 14981; Dicaptan; Dicapthion; Dicapton; Experimental Insecticide 4124; ENT 17,035; Insecticide ACC 4124; Isochlorothion; Isochlorthion; Isomeric Chlorthion; OMS-214; AC 4124; American cyanamid 4,124; BAYER 22/190; Captec; O-(4-Chloor-3-nitro-fenyl)-O,O-dimethylmonothiofosfaat; O-(4-Chlor-3-nitro-phenyl)-O,O-dimethyl-monothiophosphat; O-(4-Cloro-3-nitro-fenil)-O,O-dimetil-monotiofosfato; O-(2-Chloro-4-nitrophenyl) O,O-dimethyl phosphorothioate; O,O-Dimethyl O-2-chloro-4-nitrophenyl phosphorothioate; O,O-Dimethyl-O-(2-chloro-4-nitrophenyl)thionophosphate; Dimethyl 2-chloronitrophenyl thiophosphate; Isochloorthion; Phenol, 2-chloro-4-nitro-, O-ester with O,O-dimethyl phosphorothioate; Thiophosphate de O,O-dimethyle et de O-4-chloro-3-nitrophenyle

Phase change data

Data compiled as indicated in comments:
TRC - Thermodynamics Research Center, NIST Boulder Laboratories, Chris Muzny director
AC - William E. Acree, Jr., James S. Chickos
Quantity | Value | Units | Method | Reference | Comment |
---|---|---|---|---|---|
Tfus | 323. | K | N/A | Plato, 1972 | Uncertainty assigned by TRC = 0.2 K; TRC |
Tfus | 323.9 | K | N/A | Plato and Glasgow, 1969 | Uncertainty assigned by TRC = 0.1 K; TRC |
Enthalpy of fusion
ΔfusH (kJ/mol) | Temperature (K) | Method | Reference | Comment |
---|---|---|---|---|
29.08 | 323.9 | DSC | Donnelly, Drewes, et al., 1990 | AC |

Henry's Law data

Data compiled by: Rolf Sander
Henry's Law constant (water solution)
kH(T) = k°H exp(d(ln(kH))/d(1/T) ((1/T) - 1/(298.15 K)))
k°H = Henry's law constant for solubility in water at 298.15 K (mol/(kg*bar))
d(ln(kH))/d(1/T) = Temperature dependence constant (K)
k°H (mol/(kg*bar)) | d(ln(kH))/d(1/T) (K) | Method | Reference |
---|---|---|---|
4400. | L | N/A |

References

Plato, 1972
Plato, C.,
DSC as a general method for determining purity and heat of fusion of high-purity organic chemicals,
Anal. Chem., 1972, 44, 1531. [all data]
Plato and Glasgow, 1969
Plato, C.; Glasgow, A.R., Jr.,
Differential scanning calorimetry as a general method for determining the purity and heat of fusion of high-purity organic chemicals. Application to 95 compounds,
Anal. Chem., 1969, 41, 2, 330, https://doi.org/10.1021/ac60271a041
. [all data]
Donnelly, Drewes, et al., 1990
Donnelly, J.R.; Drewes, L.A.; Johnson, R.L.; Munslow, W.D.; Knapp, K.K.; Sovocool, G.W.,
Purity and heat of fusion data for environmental standards as determined by differential scanning calorimetry,
Thermochimica Acta, 1990, 167, 2, 155-187, https://doi.org/10.1016/0040-6031(90)80476-F
. [all data]