Ethyl tetracosanoate
- Formula: C26H52O2
- Molecular weight: 396.6899
- IUPAC Standard InChIKey: AKXFYSSXNQQBNT-UHFFFAOYSA-N
- CAS Registry Number: 24634-95-5
- Chemical structure:

Phase change data

Data compiled as indicated in comments:
AC - William E. Acree, Jr., James S. Chickos
DH - Eugene S. Domalski and Elizabeth D. Hearing
Enthalpy of fusion
ΔfusH (kJ/mol) | Temperature (K) | Reference | Comment |
---|---|---|---|
22.94 | 327.4 | Domalski and Hearing, 1996 | AC |
Enthalpy of phase transition
ΔHtrs (kJ/mol) | Temperature (K) | Initial Phase | Final Phase | Reference | Comment |
---|---|---|---|---|---|
11.203 | 317.65 | crystaline, II, á | crystaline, I, à transition | King and Garner, 1934 | DH |
22.938 | 327.35 | crystaline, I, à | liquid, liq transition | King and Garner, 1934 | DH |

Van Den Dool and Kratz RI, non-polar column, temperature ramp

View large format table.

Column type Active phase I Reference Comment
CapillaryCP Sil 5 CB2797.Heinrich, Pfeifhofer, et al., 200250. m/0.25 mm/0.15 μm, H2, 40. C @ 3. min, 4. K/min; Tend: 300. C

Normal alkane RI, non-polar column, temperature ramp

View large format table.

Column type Active phase I Reference Comment
CapillaryDB-1MS2779.13Stransky, Zarevucka, et al., 200630. m/0.252 mm/0.25 μm, H2, 1. K/min; Tstart: 240. C; Tend: 340. C

References

Domalski and Hearing, 1996
Domalski, Eugene S.; Hearing, Elizabeth D.,
Heat Capacities and Entropies of Organic Compounds in the Condensed Phase. Volume III,
J. Phys. Chem. Ref. Data, 1996, 25, 1, 1, https://doi.org/10.1063/1.555985
. [all data]
King and Garner, 1934
King, A.M.; Garner, W.E.,
The heats of crystallisation of the ethyl esters of the monobasic aliphatic acids, 1934, J. [all data]