aluminium hydroxide oxide
- Formula: AlHO2
- Molecular weight: 59.9883
- CAS Registry Number: 24623-77-6

Gas phase thermochemistry data

Quantity | Value | Units | Method | Reference | Comment |
---|---|---|---|---|---|
ΔfH°gas | -460.24 | kJ/mol | Review | Chase, 1998 | Data last reviewed in December, 1968 |
Quantity | Value | Units | Method | Reference | Comment |
S°gas,1 bar | 254.15 | J/mol*K | Review | Chase, 1998 | Data last reviewed in December, 1968 |
Gas Phase Heat Capacity (Shomate Equation)
Cp° = A + B*t + C*t2 + D*t3 +
E/t2
H° − H°298.15= A*t + B*t2/2 +
C*t3/3 + D*t4/4 − E/t + F − H
S° = A*ln(t) + B*t + C*t2/2 + D*t3/3 −
E/(2*t2) + G
Cp = heat capacity (J/mol*K)
H° = standard enthalpy (kJ/mol)
S° = standard entropy (J/mol*K)
t = temperature (K) / 1000.
View plot Requires a JavaScript / HTML 5 canvas capable browser.
Temperature (K) | 298. to 6000. |
---|---|
A | 60.80733 |
B | 15.18466 |
C | -3.608529 |
D | 0.283720 |
E | -1.407093 |
F | -483.7332 |
G | 315.4535 |
H | -460.2400 |
Reference | Chase, 1998 |
Comment | Data last reviewed in December, 1968 |

Reaction thermochemistry data

Data compiled by: John E. Bartmess
Individual Reactions
AlO2- + = HAlO2
By formula: AlO2- + H+ = HAlO2
Quantity | Value | Units | Method | Reference | Comment |
---|---|---|---|---|---|
ΔrH° | 1440. ± 130. | kJ/mol | D-EA | Desai, Wu, et al., 1996 | gas phase |

Gas phase ion energetics data

Data compiled by: John E. Bartmess
De-protonation reactions
AlO2- + = HAlO2
By formula: AlO2- + H+ = HAlO2
Quantity | Value | Units | Method | Reference | Comment |
---|---|---|---|---|---|
ΔrH° | 1440. ± 130. | kJ/mol | D-EA | Desai, Wu, et al., 1996 | gas phase |

References

Chase, 1998
Chase, M.W., Jr.,
NIST-JANAF Themochemical Tables, Fourth Edition,
J. Phys. Chem. Ref. Data, Monograph 9, 1998, 1-1951. [all data]
Desai, Wu, et al., 1996
Desai, S.R.; Wu, H.; Wang, L.-S.,
Vibrationally Resolved Photoelectron Spectroscopy of AlO- and AlO2-,
Int. J. Mass Spectrom. Ion Proc., 1996, 159, 1-3, 75, https://doi.org/10.1016/S0168-1176(96)04443-6
. [all data]