1,3-Butanediol, (S)-
- Formula: C4H10O2
- Molecular weight: 90.1210
- IUPAC Standard InChIKey: PUPZLCDOIYMWBV-SCSAIBSYSA-N
- CAS Registry Number: 24621-61-2
- Chemical structure:
View 3d structure (requires JavaScript / HTML 5) - Stereoisomers:
- Other names: (S)-(+)-1,3-Butanediol; (+)-1,3-Butanediol; D-Butane-1,3-diol; (S)-(+)-butane-1,3-diol

Phase change data

Data compiled by: Robert L. Brown and Stephen E. Stein
Reduced pressure boiling point
Tboil (K) | Pressure (atm) | Reference |
---|---|---|
382.2 | 0.018 | Aldrich Chemical Company Inc., 1990 |

References

Aldrich Chemical Company Inc., 1990
Aldrich Chemical Company Inc.,
Catalog Handbook of Fine Chemicals, Aldrich Chemical Company, Inc., Milwaukee WI, 1990, 1. [all data]