2-Naphthalenecarboxylic acid, methyl ester
- Formula: C12H10O2
- Molecular weight: 186.2066
- IUPAC Standard InChIKey: IODOXLXFXNATGI-UHFFFAOYSA-N
- CAS Registry Number: 2459-25-8
- Chemical structure:
View 3d structure (requires JavaScript / HTML 5) - Other names: 2-Naphthoic acid, methyl ester; Methyl 2-naphthalenecarboxylate; Methyl 2-naphthoate

Phase change data

Data compiled as indicated in comments:
TRC - Thermodynamics Research Center, NIST Boulder Laboratories, Chris Muzny director
AC - William E. Acree, Jr., James S. Chickos
Quantity | Value | Units | Method | Reference | Comment |
---|---|---|---|---|---|
Tfus | 350. | K | N/A | Dozen, Fujishima, et al., 1978 | Uncertainty assigned by TRC = 0.1 K; TRC |
Enthalpy of fusion
ΔfusH (kJ/mol) | Temperature (K) | Reference | Comment |
---|---|---|---|
27.1 | 350.2 | Dozen, Fujishima, et al., 1978, 2 | AC |

Van Den Dool and Kratz RI, non-polar column, temperature ramp

Column type | Active phase | I | Reference | Comment |
---|---|---|---|---|
Capillary | DB-5 | 1651. | Rostad and Pereira, 1986 | 30. m/0.26 mm/0.25 μm, He, 50. C @ 4. min, 6. K/min, 300. C @ 20. min |

Normal alkane RI, non-polar column, temperature ramp

Column type | Active phase | I | Reference | Comment |
---|---|---|---|---|
Capillary | DB-5 MS | 1646. | Ulrich, Schuurmann, et al., 2013 | 30. m/0.25 mm/0.25 μm, Helium, 50. C @ 4. min, 6. K/min, 300. C @ 20. min |

Lee's RI, non-polar column, temperature ramp

Column type | Active phase | I | Reference | Comment |
---|---|---|---|---|
Capillary | DB-5 | 279.47 | Rostad and Pereira, 1986 | 30. m/0.26 mm/0.25 μm, He, 50. C @ 4. min, 6. K/min, 300. C @ 20. min |

References

Dozen, Fujishima, et al., 1978
Dozen, Y.; Fujishima, S.; Shingu, H.,
Structures and fusion parameters of methoxycarbonyl-benzenes and -naphthalenes,
Thermochim. Acta, 1978, 25, 2, 209, https://doi.org/10.1016/0040-6031(78)85008-4
. [all data]
Dozen, Fujishima, et al., 1978, 2
Dozen, Yasuhiko; Fujishima, Shizu; Shingu, Haruo,
Structures and fusion parameters of methoxycarbonyl-benzenes and -naphthalenes,
Thermochimica Acta, 1978, 25, 2, 209-216, https://doi.org/10.1016/0040-6031(78)85008-4
. [all data]
Rostad and Pereira, 1986
Rostad, C.E.; Pereira, W.E.,
Kovats and Lee retention indices determined by gas chromatography/mass spectrometry for organic compounds of environmental interest,
J. Hi. Res. Chromatogr. Chromatogr. Comm., 1986, 9, 6, 328-334, https://doi.org/10.1002/jhrc.1240090603
. [all data]
Ulrich, Schuurmann, et al., 2013
Ulrich, N.; Schuurmann, G.; Brack, W.,
Prediction of gas chromatographic retention indices as classifier in non-target analysis of environmental samples,
J. Chromatogr. A, 2013, 1285, 139-147, https://doi.org/10.1016/j.chroma.2013.02.037
. [all data]