1-Naphthalenecarboxylic acid, methyl ester
- Formula: C12H10O2
- Molecular weight: 186.2066
- IUPAC Standard InChIKey: HMRROBKAACRWBP-UHFFFAOYSA-N
- CAS Registry Number: 2459-24-7
- Chemical structure:
View 3d structure (requires JavaScript / HTML 5) - Species with the same structure:
- Other names: 1-Naphthoic acid, methyl ester; Methyl 1-naphthalenecarboxylate; Methyl 1-naphthoate; 1-(Methoxycarbonyl)naphthalene

Van Den Dool and Kratz RI, non-polar column, temperature ramp

Column type | Active phase | I | Reference | Comment |
---|---|---|---|---|
Capillary | DB-5 | 1632. | Rostad and Pereira, 1986 | 30. m/0.26 mm/0.25 μm, He, 50. C @ 4. min, 6. K/min, 300. C @ 20. min |

Normal alkane RI, non-polar column, temperature ramp

Column type | Active phase | I | Reference | Comment |
---|---|---|---|---|
Capillary | DB-5 MS | 1625. | Ulrich, Schuurmann, et al., 2013 | 30. m/0.25 mm/0.25 μm, Helium, 50. C @ 4. min, 6. K/min, 300. C @ 20. min |

Lee's RI, non-polar column, temperature ramp

Column type | Active phase | I | Reference | Comment |
---|---|---|---|---|
Capillary | DB-5 | 276.70 | Rostad and Pereira, 1986 | 30. m/0.26 mm/0.25 μm, He, 50. C @ 4. min, 6. K/min, 300. C @ 20. min |

References

Rostad and Pereira, 1986
Rostad, C.E.; Pereira, W.E.,
Kovats and Lee retention indices determined by gas chromatography/mass spectrometry for organic compounds of environmental interest,
J. Hi. Res. Chromatogr. Chromatogr. Comm., 1986, 9, 6, 328-334, https://doi.org/10.1002/jhrc.1240090603
. [all data]
Ulrich, Schuurmann, et al., 2013
Ulrich, N.; Schuurmann, G.; Brack, W.,
Prediction of gas chromatographic retention indices as classifier in non-target analysis of environmental samples,
J. Chromatogr. A, 2013, 1285, 139-147, https://doi.org/10.1016/j.chroma.2013.02.037
. [all data]