1,2,4-Benzenetricarboxylic acid, trimethyl ester
- Formula: C12H12O6
- Molecular weight: 252.2201
- IUPAC Standard InChIKey: MJHNUUNSCNRGJE-UHFFFAOYSA-N
- CAS Registry Number: 2459-10-1
- Chemical structure:
View 3d structure (requires JavaScript / HTML 5) - Other names: Methyl trimellitate; Trimellitic acid trimethyl ester; Trimethyl trimellitate; Trimethyl 1,2,4-benzenetricarboxylate; 1,2,4-Tris(methoxycarbonyl)benzene; trimethyl benzene-1,2,4-tricarboxylate

Phase change data

Data compiled by: Robert L. Brown and Stephen E. Stein
Reduced pressure boiling point
Tboil (K) | Pressure (bar) | Reference |
---|---|---|
467.2 | 0.016 | Aldrich Chemical Company Inc., 1990 |
434. to 438. | 0.003 | Frinton Laboratories Inc., 1986 |

Kovats' RI, non-polar column, isothermal

Column type | Active phase | Temperature (C) | I | Reference | Comment |
---|---|---|---|---|---|
Packed | OV-1 | 200. | 1800. | Fedoreev and Maksimov, 1977 | Gaschrom; Column length: 1.5 m |

References

Aldrich Chemical Company Inc., 1990
Aldrich Chemical Company Inc.,
Catalog Handbook of Fine Chemicals, Aldrich Chemical Company, Inc., Milwaukee WI, 1990, 1. [all data]
Frinton Laboratories Inc., 1986
Frinton Laboratories Inc.,
Catalog Number 11, Frinton Laboratories Inc., Vineland, NJ, 1986, 99. [all data]
Fedoreev and Maksimov, 1977
Fedoreev, S.A.; Maksimov, O.B.,
The study of the composition of aromatic esters by gas-liquid chromatography,
Solid Fuel Chem. (Engl. Transl.), 1977, 17-22. [all data]