2-Pyridinecarboxylic acid, methyl ester
- Formula: C7H7NO2
- Molecular weight: 137.1360
- IUPAC Standard InChIKey: NMMIHXMBOZYNET-UHFFFAOYSA-N
- CAS Registry Number: 2459-07-6
- Chemical structure:
View 3d structure (requires JavaScript / HTML 5) - Other names: Picolinic acid, methyl ester; Methyl picolinate; Methyl 2-pyridinecarboxylate; 2-Carbomethoxypyridine; 2-(Methoxycarbonyl)pyridine; methyl pyridine-2-carboxylate

Phase change data

Data compiled as indicated in comments:
BS - Robert L. Brown and Stephen E. Stein
AC - William E. Acree, Jr., James S. Chickos
Quantity | Value | Units | Method | Reference | Comment |
---|---|---|---|---|---|
ΔvapH° | 67.0 ± 1.8 | kJ/mol | C | Ribeiro da Silva, Freitas, et al., 2007 | AC |
ΔvapH° | 64.1 ± 0.1 | kJ/mol | N/A | Ribeiro da Silva, Freitas, et al., 2007 | Based on data from 273. to 340. K.; AC |
Reduced pressure boiling point
Tboil (K) | Pressure (bar) | Reference | Comment |
---|---|---|---|
389. to 392. | 0.021 | Frinton Laboratories Inc., 1986 | BS |

Van Den Dool and Kratz RI, non-polar column, temperature ramp

Column type | Active phase | I | Reference | Comment |
---|---|---|---|---|
Capillary | DB-5 | 1075. | Premecz and Ford, 1987 | He, 60. C @ 10. min, 10. K/min, 280. C @ 3. min; Column length: 30. m; Column diameter: 0.32 mm |

Van Den Dool and Kratz RI, polar column, temperature ramp

Column type | Active phase | I | Reference | Comment |
---|---|---|---|---|
Capillary | CAM | 1879. | Premecz and Ford, 1987 | He, 60. C @ 5. min, 5. K/min, 240. C @ 21. min; Column length: 15. m; Column diameter: 0.24 mm |

Normal alkane RI, polar column, temperature ramp

Column type | Active phase | I | Reference | Comment |
---|---|---|---|---|
Capillary | FFAP | 1804. | Budryn, Nebesny, et al., 2011 | 30. m/0.32 mm/0.50 μm, Nitrogen, 35. C @ 5. min, 4. K/min, 250. C @ 45. min |

References

Ribeiro da Silva, Freitas, et al., 2007
Ribeiro da Silva, Maria D.M.C.; Freitas, Vera L.S.; Santos, Luís M.N.B.F.; Fulem, Michal; Sottomayor, M.J.; Monte, Manuel J.S.; Acree, W.E.,
Thermodynamic Properties of Three Pyridine Carboxylic Acid Methyl Ester Isomers,
J. Chem. Eng. Data, 2007, 52, 2, 580-585, https://doi.org/10.1021/je060472e
. [all data]
Frinton Laboratories Inc., 1986
Frinton Laboratories Inc.,
Catalog Number 11, Frinton Laboratories Inc., Vineland, NJ, 1986, 99. [all data]
Premecz and Ford, 1987
Premecz, J.E.; Ford, M.E.,
Gas chromatographic separation of substituted pyridines,
J. Chromatogr., 1987, 388, 23-35, https://doi.org/10.1016/S0021-9673(01)94463-2
. [all data]
Budryn, Nebesny, et al., 2011
Budryn, G.; Nebesny, E.; Kula, J.; Majda, T.; Krysiak, W.,
HS-SPME/GC/MS Profiles of convectively and microwave roasted Ivory Coast Robusta coffee brews,
Czech. J. Food Sci., 2011, 29, 2, 151-160. [all data]