(E,Z)-1,3,5-heptatriene
- Formula: C7H10
- Molecular weight: 94.1543
- IUPAC Standard InChIKey: USKZHEQYENVSMH-XGXWUAJZSA-N
- CAS Registry Number: 24587-25-5
- Chemical structure:
View 3d structure (requires JavaScript / HTML 5) - Stereoisomers:

Reaction thermochemistry data

Data compiled by: Hussein Y. Afeefy, Joel F. Liebman, and Stephen E. Stein
Individual Reactions
By formula: C7H10 = C7H10
Quantity | Value | Units | Method | Reference | Comment |
---|---|---|---|---|---|
ΔrH° | -3.5 ± 0.2 | kJ/mol | Eqk | Egger and James, 1971 | gas phase; At 200 °C |

Normal alkane RI, polar column, temperature ramp

Column type | Active phase | I | Reference | Comment |
---|---|---|---|---|
Capillary | DB-Wax | 1020. | Horiuchi, Umano, et al., 1998 | 60. m/0.25 mm/1. μm, He, 3. K/min, 200. C @ 40. min; Tstart: 50. C |

References

Egger and James, 1971
Egger, K.W.; James, T.Li.,
Thermodynamic data from equilibrium studies of the nitric oxide catalyzed isomerization of 1,3,5-heptatriene in the gas phase,
J. Chem. Soc. B, 1971, 348-350. [all data]
Horiuchi, Umano, et al., 1998
Horiuchi, M.; Umano, K.; Shibamoto, T.,
Analysis of volatile compounds formed from fish oil heated with cysteine and trimethylamine oxide,
J. Agric. Food Chem., 1998, 46, 12, 5232-5237, https://doi.org/10.1021/jf980482m
. [all data]