cis-1,3,5-trimethylcyclohexene
- Formula: C9H16
- Molecular weight: 124.2233
- IUPAC Standard InChIKey: PKHOIUJRGGWFEF-VXNVDRBHSA-N
- CAS Registry Number: 24583-97-9
- Chemical structure:
View 3d structure (requires JavaScript / HTML 5) - Stereoisomers:

Phase change data

Data compiled by: Thermodynamics Research Center, NIST Boulder Laboratories, Chris Muzny director
Quantity | Value | Units | Method | Reference | Comment |
---|---|---|---|---|---|
Tboil | 415.1 | K | N/A | Anonymous, 1949 | Uncertainty assigned by TRC = 0.6 K |
Quantity | Value | Units | Method | Reference | Comment |
Tfus | 185.7 | K | N/A | Anonymous, 1949 | Uncertainty assigned by TRC = 0.3 K |

References

Anonymous, 1949
Anonymous, R.,
, Am. Pet. Inst. Res. Proj. 45, Ohio State Univ., 1949. [all data]