3,3-Dimethylbutanoic acid, 1,1,2-trimethylpropyl ester

Phase change data

Data compiled by: William E. Acree, Jr., James S. Chickos

Quantity Value Units Method Reference Comment
Δvap57.1kJ/molCGCVerevkin and Heintz, 1999Based on data from 333. - 378. K.

References

Verevkin and Heintz, 1999
Verevkin, Sergey P.; Heintz, Andreas, Determination of Vaporization Enthalpies of the Branched Esters from Correlation Gas Chromatography and Transpiration Methods, J. Chem. Eng. Data, 1999, 44, 6, 1240-1244, https://doi.org/10.1021/je990122a . [all data]