Hexanoic acid, 2-butyl-, methyl ester
- Formula: C11H22O2
- Molecular weight: 186.2912
- IUPAC Standard InChIKey: AZTDAGYTELUSHF-UHFFFAOYSA-N
- CAS Registry Number: 24551-95-9
- Chemical structure:
View 3d structure (requires JavaScript / HTML 5) - Other names: Methyl-2-butylhexanoate

Phase change data

Data compiled by: Thermodynamics Research Center, NIST Boulder Laboratories, Chris Muzny director
Quantity | Value | Units | Method | Reference | Comment |
---|---|---|---|---|---|
Tboil | 479.15 | K | N/A | Schulte, Krause, et al., 1951 | Uncertainty assigned by TRC = 1. K |

Kovats' RI, non-polar column, isothermal

Column type | Active phase | Temperature (C) | I | Reference | Comment |
---|---|---|---|---|---|
Packed | Squalane | 120. | 1150. | Schomburg, 1964 |

References

Schulte, Krause, et al., 1951
Schulte, K.E.; Krause, H.; Kirschner, J.,
Z. Physiol. Chem., 1951, 287, 239. [all data]
Schomburg, 1964
Schomburg, G.,
Gas-Chromatographische Retentionsdaten und Struktur Chemischer Verbindungen. I. Verzweigte Aliphatische und Alicyclische Carbonsäure-Methylester,
J. Chromatogr., 1964, 14, 157-177, https://doi.org/10.1016/S0021-9673(00)86608-X
. [all data]