Butane, 1-(2,2-dichloro-1-methylcyclopropyl)-3-methyl-
- Formula: C9H16Cl2
- Molecular weight: 195.129
- IUPAC Standard InChIKey: SZDCIZLZSRDCSY-UHFFFAOYSA-N
- CAS Registry Number: 24551-81-3
- Chemical structure:
View 3d structure (requires JavaScript / HTML 5) - Other names: 1,1-Dichloro-2-isopentyl-2-methylcyclopropane; Cyclopropane, 1,1-dichloro-2-methyl-2-(3-methylbutyl)

Normal alkane RI, non-polar column, temperature ramp

Column type | Active phase | I | Reference | Comment |
---|---|---|---|---|
Capillary | OV-101 | 1134. | Chupalov, Molchanov, et al., 1994 | N2, 3. K/min; Column length: 52. m; Column diameter: 0.26 mm; Tstart: 50. C; Tend: 220. C |

Normal alkane RI, polar column, temperature ramp

Column type | Active phase | I | Reference | Comment |
---|---|---|---|---|
Packed | Carbowax 20M | 1364. | Chupalov, Molchanov, et al., 1994 | N2, Chromaton N-AW, 3. K/min; Column length: 3. m; Column diameter: 0.26 mm; Tstart: 50. C; Tend: 220. C |

References

Chupalov, Molchanov, et al., 1994
Chupalov, A.A.; Molchanov, A.p.; Zenkevich, I.G.,
Chromato-Mass-Spectrometric Characterization of Alkyl- and Aryl-1,1-dichlorocyclopropanes,
Zh. Obshch. Khim., 1994, 64, 6, 966-974. [all data]