Urea-1-hexadecene adduct

Phase change data

Data compiled by: Eugene S. Domalski and Elizabeth D. Hearing

Enthalpy of phase transition

ΔHtrs (kJ/mol) Temperature (K) Initial Phase Final Phase Reference Comment
0.1402141.7crystaline, IIcrystaline, ICope and Parsonage, 1969

Entropy of phase transition

ΔStrs (J/mol*K) Temperature (K) Initial Phase Final Phase Reference Comment
0.99141.7crystaline, IIcrystaline, ICope and Parsonage, 1969

References

Cope and Parsonage, 1969
Cope, A.F.G.; Parsonage, N.G., Thermodynamic properties of urea + hydrocarbon adducts from 12 to 300 K. The heat capacities and entropies of the adducts of the n-paraffin C11H24 and the 1-olefins C10H20, C16H32, and C20H40, J. Chem. Thermodynam., 1969, 1, 99-110. [all data]