2-Butanone, 1-(4-chlorophenoxy)-3,3-dimethyl-
- Formula: C12H15ClO2
- Molecular weight: 226.699
- IUPAC Standard InChIKey: WISVKXCNQOLCJL-UHFFFAOYSA-N
- CAS Registry Number: 24473-06-1
- Chemical structure:
View 3d structure (requires JavaScript / HTML 5) - Other names: 1-(4-chlorophenoxy)-3,3-dimethyl-2-butanone

Phase change data

Data compiled by: Thermodynamics Research Center, NIST Boulder Laboratories, Chris Muzny director
Quantity | Value | Units | Method | Reference | Comment |
---|---|---|---|---|---|
Tfus | 333.95 | K | N/A | Vorontsova and Vlasov, 1987 | Crystal phase 1 phase; Uncertainty assigned by TRC = 0.5 K |

References

Vorontsova and Vlasov, 1987
Vorontsova, N.A.; Vlasov, O.N.,
Determination of saturated vapor pressure of Bayletone and its semiproducts,
Deposited Doc. ONIITEkhim Cherkassy, 1987, Doc. No. 1423 khp - 87, 1987. [all data]