S,S-dichloro-N-(trifluoroacetyl) sulfilimine

Phase change data

Data compiled by: William E. Acree, Jr., James S. Chickos

Enthalpy of vaporization

ΔvapH (kJ/mol) Temperature (K) Method Reference Comment
44.2319.AStephenson and Malanowski, 1987Based on data from 306. - 333. K. See also Glemser and Halasz, 1969 and Dykyj, Svoboda, et al., 1999.

References

Stephenson and Malanowski, 1987
Stephenson, Richard M.; Malanowski, Stanislaw, Handbook of the Thermodynamics of Organic Compounds, 1987, https://doi.org/10.1007/978-94-009-3173-2 . [all data]

Glemser and Halasz, 1969
Glemser, O.; Halasz, v., Über die darstellung von N-trifluoracetyl-schwefeldifluoridimid und N-trifluoracetyl-schwefeldichloridimid und N,N´ -hexafluorpropan-2-amino 2-schwefeldi-fluoridimid, Inorganic and Nuclear Chemistry Letters, 1969, 5, 5, 393-398, https://doi.org/10.1016/0020-1650(69)80088-7 . [all data]

Dykyj, Svoboda, et al., 1999
Dykyj, J.; Svoboda, J.; Wilhoit, R.C.; Frenkel, M.L.; Hall, K.R., Vapor Pressure of Chemicals: Part A. Vapor Pressure and Antoine Constants for Hydrocarbons and Sulfur, Selenium, Tellurium and Hydrogen Containing Organic Compounds, Springer, Berlin, 1999, 373. [all data]