Ethyl trans-2-pentenoate
- Formula: C7H12O2
- Molecular weight: 128.1690
- IUPAC Standard InChIKey: AGMKVZDPATUSMS-AATRIKPKSA-N
- CAS Registry Number: 24410-84-2
- Chemical structure:
View 3d structure (requires JavaScript / HTML 5) - Stereoisomers:
- Other names: (E)-2-Pentenoic acid ethyl ester

Gas phase thermochemistry data

Data compiled by: Hussein Y. Afeefy, Joel F. Liebman, and Stephen E. Stein
Quantity | Value | Units | Method | Reference | Comment |
---|---|---|---|---|---|
ΔfH°gas | -394. ± 4. | kJ/mol | Ccb | Schjanberg, 1938 | Heat of formation derived by Cox and Pilcher, 1970 |

Condensed phase thermochemistry data

Data compiled by: Hussein Y. Afeefy, Joel F. Liebman, and Stephen E. Stein
Quantity | Value | Units | Method | Reference | Comment |
---|---|---|---|---|---|
ΔfH°liquid | -442. ± 3. | kJ/mol | Ccb | Schjanberg, 1938 | Heat of formation derived by Cox and Pilcher, 1970 |
Quantity | Value | Units | Method | Reference | Comment |
ΔcH°liquid | -4020. ± 10. | kJ/mol | Ccb | Schjanberg, 1937 | At 293 K; Corresponding ΔfHºliquid = -449.4 kJ/mol (simple calculation by NIST; no Washburn corrections) |

Phase change data

Data compiled as indicated in comments:
ALS - Hussein Y. Afeefy, Joel F. Liebman, and Stephen E. Stein
DRB - Donald R. Burgess, Jr.
Quantity | Value | Units | Method | Reference | Comment |
---|---|---|---|---|---|
ΔvapH° | 48. ± 1. | kJ/mol | E | Schjanberg, 1938 | Heat of formation derived by Cox and Pilcher, 1970; ALS |
ΔvapH° | 48.0 | kJ/mol | N/A | Schjanberg, 1938 | DRB |
Enthalpy of vaporization
ΔvapH (kJ/mol) | Temperature (K) | Method | Reference | Comment |
---|---|---|---|---|
39. | 293. | V | Schjanberg, 1937 | At 293 K; ALS |

References

Schjanberg, 1938
Schjanberg, E.,
Cis-pentensyreetylestrarnas forbranningsvarmen, refraktionsdata och alkaliska hydrolys,
Svensk. Kim. Tidr., 1938, 50, 102-106. [all data]
Cox and Pilcher, 1970
Cox, J.D.; Pilcher, G.,
Thermochemistry of Organic and Organometallic Compounds, Academic Press, New York, 1970, 1-636. [all data]
Schjanberg, 1937
Schjanberg, E.,
Die verbrennungswarmen und die refraktionsdaten einiger pentensaureeste,
Z. Phys. Chem., 1937, 178, 274-281. [all data]