Benzofuran, 3,6-dimethyl-
- Formula: C10H10O
- Molecular weight: 146.1858
- IUPAC Standard InChIKey: VQIHEXZMNXLAFR-UHFFFAOYSA-N
- CAS Registry Number: 24410-50-2
- Chemical structure:
View 3d structure (requires JavaScript / HTML 5) - Other names: 3,6-Dimethyl-benzo-[b]-furan; Benzofurane, 3,6-dimethyl

Normal alkane RI, non-polar column, custom temperature program

Column type | Active phase | I | Reference | Comment |
---|---|---|---|---|
Capillary | SE-30 | 1185. | Vinogradov, 2004 | Program: not specified |
Capillary | Polydimethyl siloxanes | 1185. | Zenkevich, 1997 | Program: not specified |

Normal alkane RI, polar column, temperature ramp

Column type | Active phase | I | Reference | Comment |
---|---|---|---|---|
Capillary | Supelcowax | 1730. | Näf and Velluz, 1998 | He, 5. K/min; Column length: 60. m; Column diameter: 0.25 mm; Tstart: 80. C; Tend: 240. C |

References

Vinogradov, 2004
Vinogradov, B.A.,
Production, composition, properties and application of essential oils, 2004, retrieved from http://viness.narod.ru. [all data]
Zenkevich, 1997
Zenkevich, I.G.,
Analytical Parameters of Components of Essential Oils for their Chromatographic and Chromato-Spectral Identificaiton. Oxsigenated derivatives of Mono- and Sesquiterpene Hydrocarbons,
Rastit, Resursy (Rus.), 1997, 33, 1, 16-28. [all data]
Näf and Velluz, 1998
Näf, R.; Velluz, A.,
Phenols and lactones in Italo-Mitcham peppermint oil Mentha × piperita L.,
Flavour Fragr. J., 1998, 13, 3, 203-208, https://doi.org/10.1002/(SICI)1099-1026(199805/06)13:3<203::AID-FFJ725>3.0.CO;2-0
. [all data]