ethyliodomercury
- Formula: C2H5HgI
- Molecular weight: 356.56
- CAS Registry Number: 2440-42-8

Gas phase thermochemistry data

Data compiled by: José A. Martinho Simões
Quantity | Value | Units | Method | Reference | Comment |
---|---|---|---|---|---|
ΔfH°gas | 14.3 ± 4.1 | kJ/mol | Review | Martinho Simões | The enthalpy of formation relies on 30.2 ± 1.5 kJ/mol for the enthalpy of formation of Hg(Et)2(l). |

Condensed phase thermochemistry data

Data compiled by: José A. Martinho Simões
Quantity | Value | Units | Method | Reference | Comment |
---|---|---|---|---|---|
ΔfH°solid | -65.2 ± 2.9 | kJ/mol | Review | Martinho Simões | The enthalpy of formation relies on 30.2 ± 1.5 kJ/mol for the enthalpy of formation of Hg(Et)2(l). |

Phase change data

Data compiled as indicated in comments:
MS - José A. Martinho Simões
AC - William E. Acree, Jr., James S. Chickos
Quantity | Value | Units | Method | Reference | Comment |
---|---|---|---|---|---|
ΔsubH° | 19.0 ± 0.69 | kcal/mol | RSC | Charnley and Skinner, 1951 | MS |
Enthalpy of sublimation
ΔsubH (kcal/mol) | Temperature (K) | Method | Reference | Comment |
---|---|---|---|---|
19.0 ± 0.69 | 294.5 | V | Stephenson and Malanowski, 1987 | Based on data from 286. to 303. K. See also Pilcher and Skinner, 1983, Hartley, Pritchard, et al., 1951, and Charnley and Skinner, 1951, 2.; AC |

Reaction thermochemistry data

Data compiled by: José A. Martinho Simões
Individual Reactions
By formula: C4H10Hg (l) + HgI2 (cr) = 2C2H5HgI (cr)
Quantity | Value | Units | Method | Reference | Comment |
---|---|---|---|---|---|
ΔrH° | -13.2 ± 1.3 | kcal/mol | RSC | Hartley, Pritchard, et al., 1951 | Please also see Pedley and Rylance, 1977 and Cox and Pilcher, 1970. |

References

Martinho Simões
Martinho Simões, J.A.,
Private communication (see http://webbook.nist.gov/chemistry/om/). [all data]