Benzoic acid, 3-bromo-, ethyl ester
- Formula: C9H9BrO2
- Molecular weight: 229.071
- IUPAC Standard InChIKey: QAUASTLEZAPQTB-UHFFFAOYSA-N
- CAS Registry Number: 24398-88-7
- Chemical structure:
View 3d structure (requires JavaScript / HTML 5) - Other names: Benzoic acid, m-bromo-, ethyl ester; Ethyl 3-bromobenzoate; 3-Bromobenzoic acid, ethyl ester

Phase change data

Data compiled by: Robert L. Brown and Stephen E. Stein
Quantity | Value | Units | Method | Reference | Comment |
---|---|---|---|---|---|
Tboil | 534.2 | K | N/A | Weast and Grasselli, 1989 | |
Tboil | 534. | K | N/A | Buckingham and Donaghy, 1982 |
Reduced pressure boiling point
Tboil (K) | Pressure (bar) | Reference |
---|---|---|
403.7 | 0.016 | Aldrich Chemical Company Inc., 1990 |

References

Weast and Grasselli, 1989
CRC Handbook of Data on Organic Compounds, 2nd Editon, Weast,R.C and Grasselli, J.G., ed(s)., CRC Press, Inc., Boca Raton, FL, 1989, 1. [all data]
Buckingham and Donaghy, 1982
Buckingham, J.; Donaghy, S.M.,
Dictionary of Organic Compounds: Fifth Edition, Chapman and Hall, New York, 1982, 1. [all data]
Aldrich Chemical Company Inc., 1990
Aldrich Chemical Company Inc.,
Catalog Handbook of Fine Chemicals, Aldrich Chemical Company, Inc., Milwaukee WI, 1990, 1. [all data]