2,3,5-Trimethylbenzoic acid
- Formula: C10H12O2
- Molecular weight: 164.2011
- IUPAC Standard InChIKey: WJPISYUIIFJNPA-UHFFFAOYSA-N
- CAS Registry Number: 2437-66-3
- Chemical structure:
View 3d structure (requires JavaScript / HTML 5) - Permanent link for this species. Use this link for bookmarking this species for future reference.

Phase change data

Data compiled as indicated in comments:
ALS - Hussein Y. Afeefy, Joel F. Liebman, and Stephen E. Stein
DRB - Donald R. Burgess, Jr.
AC - William E. Acree, Jr., James S. Chickos
Quantity | Value | Units | Method | Reference | Comment |
---|---|---|---|---|---|
ΔsubH° | 25.50 ± 0.07 | kcal/mol | V | Colomina, Jimenez, et al., 1987 | see Colomina, Turrion, et al., 1964; ALS |
ΔsubH° | 25.50 | kcal/mol | N/A | Colomina, Jimenez, et al., 1987 | DRB |
ΔsubH° | 25.50 ± 0.07 | kcal/mol | ME | Colomina, Jimenez, et al., 1987 | Based on data from 320. to 338. K.; AC |
Enthalpy of sublimation
ΔsubH (kcal/mol) | Temperature (K) | Method | Reference | Comment |
---|---|---|---|---|
25.26 ± 0.07 | 329. | ME | Colomina, Jimenez, et al., 1987 | Based on data from 320. to 338. K.; AC |

Gas phase ion energetics data

Data compiled by: John E. Bartmess
De-protonation reactions
C10H11O2- + =
By formula: C10H11O2- + H+ = C10H12O2
Quantity | Value | Units | Method | Reference | Comment |
---|---|---|---|---|---|
ΔrG° | 332.1 ± 2.1 | kcal/mol | IMRE | Decouzon, Gal, et al., 1997 | gas phase |

Reaction thermochemistry data

Data compiled by: John E. Bartmess
Individual Reactions
C10H11O2- + =
By formula: C10H11O2- + H+ = C10H12O2
Quantity | Value | Units | Method | Reference | Comment |
---|---|---|---|---|---|
ΔrG° | 332.1 ± 2.1 | kcal/mol | IMRE | Decouzon, Gal, et al., 1997 | gas phase |

References

Colomina, Jimenez, et al., 1987
Colomina, M.; Jimenez, P.; Roux, M.V.; Turrion, C.,
Thermochemical properties of benzoic acid derivatives. XV. Vapour pressures and enthalpies of sublimation and formation of the six trimethylbenzoic acids,
J. Chem. Thermodyn., 1987, 19, 1139-1144. [all data]
Colomina, Turrion, et al., 1964
Colomina, M.; Turrion, C.; Boned, M.L.; Panea, M.,
Investigaciones termoquimicas sobre los acidos alquilbenzoicos. III. Acidos trimetilbenzoicos,
Anal. Fisc. Quim. B, 1964, 60, 619-626. [all data]