1-Tridecene
- Formula: C13H26
- Molecular weight: 182.3455
- IUPAC Standard InChIKey: VQOXUMQBYILCKR-UHFFFAOYSA-N
- CAS Registry Number: 2437-56-1
- Chemical structure:
View 3d structure (requires JavaScript / HTML 5) - Other names: n-Tridec-1-ene; 1-C13H26; Tridecene-1; α-Tridecene; Tridec-1-ene

Phase change data

Data compiled as indicated in comments:
BS - Robert L. Brown and Stephen E. Stein
TRC - Thermodynamics Research Center, NIST Boulder Laboratories, Chris Muzny director
AC - William E. Acree, Jr., James S. Chickos
Quantity | Value | Units | Method | Reference | Comment |
---|---|---|---|---|---|
Tboil | 505. | K | N/A | Farchan Laboratories, 1990 | BS |
Tboil | 506.0 | K | N/A | Weast and Grasselli, 1989 | BS |
Tboil | 501. | K | N/A | Petrov, Sergienko, et al., 1956 | Uncertainty assigned by TRC = 5. K; TRC |
Tboil | 507.0 | K | N/A | Tilicheev, Peshkov, et al., 1949 | Uncertainty assigned by TRC = 2. K; TRC |
Tboil | 503. | K | N/A | Pictet and Potok, 1919 | Uncertainty assigned by TRC = 8. K; isomer not definitely identified; TRC |
Quantity | Value | Units | Method | Reference | Comment |
Tfus | 250.3 ± 0.8 | K | AVG | N/A | Average of 8 values; Individual data points |
Quantity | Value | Units | Method | Reference | Comment |
ΔvapH° | 65.3 | kJ/mol | N/A | Reid, 1972 | AC |
Enthalpy of vaporization
ΔvapH (kJ/mol) | Temperature (K) | Method | Reference | Comment |
---|---|---|---|---|
53.9 | 428. | A | Stephenson and Malanowski, 1987 | Based on data from 413. to 509. K. See also Camin and Rossini, 1955.; AC |
Antoine Equation Parameters
log10(P) = A − (B / (T + C))
P = vapor pressure (bar)
T = temperature (K)
View plot Requires a JavaScript / HTML 5 canvas capable browser.
Temperature (K) | A | B | C | Reference |
---|---|---|---|---|
415.8 to 505.81 | 4.11053 | 1674.741 | -97.936 | Camin and Rossini, 1955 |

Reaction thermochemistry data

Data compiled by: Hussein Y. Afeefy, Joel F. Liebman, and Stephen E. Stein
Individual Reactions
By formula: H2 + C13H26 = C13H28
Quantity | Value | Units | Method | Reference | Comment |
---|---|---|---|---|---|
ΔrH° | -30.07 ± 0.46 | kcal/mol | Chyd | Rogers and Skanupong, 1974 | liquid phase; solvent: Hexane |

Gas phase ion energetics data

Data compiled as indicated in comments:
LL - Sharon G. Lias and Joel F. Liebman
LLK - Sharon G. Lias, Rhoda D. Levin, and Sherif A. Kafafi
Ionization energy determinations
IE (eV) | Method | Reference | Comment |
---|---|---|---|
9.30 ± 0.05 | EI | Holmes and Lossing, 1991 | LL |
9.38 | EI | Holmes, Fingas, et al., 1981 | LLK |

Normal alkane RI, non-polar column, custom temperature program

Data compiled by: NIST Mass Spectrometry Data Center, William E. Wallace, director

Column type CapillaryCapillaryCapillaryCapillaryCapillary
Active phase HP-5CP Sil 8 CBRTX-5BP-5BP-5
Column length (m) 30.30.30.25.25.
Carrier gas HeliumHeliumN2HeliumHelium
Substrate
Column diameter (mm) 0.320.250.250.320.32
Phase thickness (μm) 0.250.250.250.500.50
Program not specifiednot specifiednot specified60 0C 6 0C/min -> 210 0C 10 0C/min -> 290 0C (10 min)not specified
I 1292.1292.1290.1293.1292.
ReferenceKahriman, Tosun, et al., 2011Marques, Wendler, et al., 2007Ádámová, Orinák, et al., 2005Eyres, Dufour, et al., 2005Eyres, Dufour, et al., 2005
Comment MSDC-RI MSDC-RI MSDC-RI MSDC-RI MSDC-RI
Column type CapillaryCapillaryCapillaryCapillary
Active phase Polydimethyl siloxaneDB-5 MSHP-5OV-1, SE-30, Methyl silicone, SP-2100, OV-101, DB-1, etc.
Column length (m)  30.50.50.
Carrier gas  HeliumHeHydrogen
Substrate
Column diameter (mm)  0.250.320.32
Phase thickness (μm)  1.00.52
Program not specifiednot specified35 0C 10 0C/min -> 200 0C (20 min) 5 0C/min -> 230 0C (50 min)not specified
I 1283.1283.1289.1289.
ReferenceJunkes, Castanho, et al., 2003Luo and Agnew, 2001Timón, Ventanas, et al., 1998Waggott and Davies, 1984
Comment MSDC-RI MSDC-RI MSDC-RI MSDC-RI

Van Den Dool and Kratz RI, non-polar column, custom temperature program

Data compiled by: NIST Mass Spectrometry Data Center, William E. Wallace, director

Column type Capillary
Active phase DB-5
Column length (m) 30.
Carrier gas He
Substrate
Column diameter (mm) 0.25
Phase thickness (μm)
Program 30C => 5K/min=120C => 10C/min => 270C
I 1292.
ReferenceZaikin and Borisov, 2002
Comment MSDC-RI

Kovats' RI, non-polar column, isothermal

Data compiled by: NIST Mass Spectrometry Data Center, William E. Wallace, director

Column type CapillaryCapillaryCapillaryCapillaryCapillary
Active phase SqualaneDB-1DB-1DB-1OV-101
Column length (m)  10.10.30.50.
Carrier gas  HeHe He
Substrate
Column diameter (mm)  0.250.250.250.25
Phase thickness (μm)  0.250.250.25
Temperature (C) 100.140.60.240.110.
I 1283.1288.1289.1289.1289.
ReferenceHeinzen, Soares, et al., 1999Beens, Tijssen, et al., 1998Beens, Tijssen, et al., 1998Hanai and Hong, 1989Rang, Kuningas, et al., 1987
Comment MSDC-RI MSDC-RI MSDC-RI MSDC-RI MSDC-RI
Column type CapillaryPackedCapillaryCapillaryCapillary
Active phase OV-101SE-30SqualaneSqualaneSqualane
Column length (m) 50.3.62.
Carrier gas HeAr
Substrate  Gas Chrom Q (80-100 mesh)
Column diameter (mm) 0.25 0.25
Phase thickness (μm)
Temperature (C) 110.150.74.100.115.
I 1289.1290.1288.71283.1284.
ReferenceRang, Kuningas, et al., 1987Tiess, 1984Soják, Kraus, et al., 1982Sojak, Hrivnak, et al., 1973Sojak, Hrivnak, et al., 1973
Comment MSDC-RI MSDC-RI MSDC-RI MSDC-RI MSDC-RI
Column type CapillaryCapillary
Active phase SqualaneSqualane
Column length (m)
Carrier gas
Substrate
Column diameter (mm)
Phase thickness (μm)
Temperature (C) 130.86.
I 1284.1283.
ReferenceSojak, Hrivnak, et al., 1973Sojak, Hrivnak, et al., 1973
Comment MSDC-RI MSDC-RI

References

Farchan Laboratories, 1990
Farchan Laboratories,
Research Chemicals Catalog, Farchan Laboratories, Gainesville, FL, 1990, 91. [all data]
Weast and Grasselli, 1989
CRC Handbook of Data on Organic Compounds, 2nd Editon, Weast,R.C and Grasselli, J.G., ed(s)., CRC Press, Inc., Boca Raton, FL, 1989, 1. [all data]
Petrov, Sergienko, et al., 1956
Petrov, A.A.; Sergienko, S.R.; Tsedilina, A.L.; Egorov, Yu.P.,
Isomeric conversions of unsaturated hydrocarbons, c(12)-c(16),
Khim. Tekhnol. Topl. Masel, 1956, 1, 26-32. [all data]
Tilicheev, Peshkov, et al., 1949
Tilicheev, M.D.; Peshkov, V.P.; Yuganova, S.A.,
Determination of the purity and identification of 1-alkenes by means of a thermal method,
Zh. Anal. Khim., 1949, 4, 298. [all data]
Pictet and Potok, 1919
Pictet, A.; Potok, J.,
The Distillation of Sodium Stearate and Oleate Under Reduced Pressure and the Origin of Petroleum,
Helv. Chim. Acta, 1919, 2, 501. [all data]
Reid, 1972
Reid, Robert C.,
Handbook on vapor pressure and heats of vaporization of hydrocarbons and related compounds, R. C. Wilhort and B. J. Zwolinski, Texas A Research Foundation. College Station, Texas(1971). 329 pages.$10.00,
AIChE J., 1972, 18, 6, 1278-1278, https://doi.org/10.1002/aic.690180637
. [all data]
Stephenson and Malanowski, 1987
Stephenson, Richard M.; Malanowski, Stanislaw,
Handbook of the Thermodynamics of Organic Compounds, 1987, https://doi.org/10.1007/978-94-009-3173-2
. [all data]
Camin and Rossini, 1955
Camin, David L.; Rossini, Frederick D.,
Physical Properties of Fourteen API Research Hydrocarbons, C 9 to C 15,
J. Phys. Chem., 1955, 59, 11, 1173-1179, https://doi.org/10.1021/j150533a014
. [all data]