Zr(Bz)4
- Formula: C28H28Zr
- Molecular weight: 455.746
- CAS Registry Number: 24356-01-2

Condensed phase thermochemistry data

Data compiled by: José A. Martinho Simões
Quantity | Value | Units | Method | Reference | Comment |
---|---|---|---|---|---|
ΔfH°solid | 270. ± 16. | kJ/mol | Review | Martinho Simões | The enthalpy of formation relies on -1796. ± 15. kJ/mol for the enthalpy of formation of Zr(O-i-Pr)4(cr) |

Phase change data

Data compiled by: José A. Martinho Simões
Quantity | Value | Units | Method | Reference | Comment |
---|---|---|---|---|---|
ΔsubH° | 87.9 ± 8.4 | kJ/mol | RSC | Lappert, Patil, et al., 1975 |

Gas phase thermochemistry data

Data compiled by: José A. Martinho Simões
Quantity | Value | Units | Method | Reference | Comment |
---|---|---|---|---|---|
ΔfH°gas | 85.4 ± 4.3 | kcal/mol | Review | Martinho Simões | The enthalpy of formation relies on -429.3 ± 3.7 kcal/mol for the enthalpy of formation of Zr(O-i-Pr)4(cr) |

References

Martinho Simões
Martinho Simões, J.A.,
Private communication (see http://webbook.nist.gov/chemistry/om/). [all data]
Lappert, Patil, et al., 1975
Lappert, M.F.; Patil, D.S.; Pedley, J.B.,
J. Chem. Soc., Chem. Commun., 1975, 830.. [all data]