1-Pentene, 3-chloro-
- Formula: C5H9Cl
- Molecular weight: 104.578
- IUPAC Standard InChIKey: GEVKGFRTXNJNKK-UHFFFAOYSA-N
- CAS Registry Number: 24356-00-1
- Chemical structure:
View 3d structure (requires JavaScript / HTML 5) - Species with the same structure:
- Other names: 3-chloro-1-pentene

Reaction thermochemistry data

Data compiled by: Hussein Y. Afeefy, Joel F. Liebman, and Stephen E. Stein
Individual Reactions
By formula: C5H9Cl = C5H9Cl
Quantity | Value | Units | Method | Reference | Comment |
---|---|---|---|---|---|
ΔrH° | 4.2 | kJ/mol | Eqk | Shishinova, Levanova, et al., 1978 | liquid phase; Heat of isomerization |

Normal alkane RI, non-polar column, temperature ramp

Column type | Active phase | I | Reference | Comment |
---|---|---|---|---|
Capillary | OV-101 | 688. | Zenkevich, 2005 | 25. m/0.20 mm/0.10 μm, N2/He, 6. K/min; Tstart: 50. C; Tend: 250. C |

References

Shishinova, Levanova, et al., 1978
Shishinova, V.I.; Levanova, S.V.; Shevtsova, L.A.; Rozhnov, A.M.,
The isomerisation of halogenoalkenes,
Russ. J. Phys. Chem. (Engl. Transl.), 1978, 52, 1065-1066. [all data]
Zenkevich, 2005
Zenkevich, I.G.,
Experimentally measured retention indices., 2005. [all data]