4,7-Ethanoisobenzofuran-1,3-dione, 3a,4,7,7a-tetrahydro-, (3aα,4α,7α,7aα)-
- Formula: C10H10O3
- Molecular weight: 178.1846
- IUPAC Standard InChIKey: YIHKILSPWGDWPR-HYNHDVCUSA-N
- CAS Registry Number: 24327-08-0
- Chemical structure:
View 3d structure (requires JavaScript / HTML 5) - Stereoisomers:
- Other names: Bicyclo[2.2.2]oct-5-ene-2,3-dicarboxylic anhydride, cis-endo-; endo-Bicyclo[2.2.2]octenedicarboxcyclic acid anhydride; Bicyclo[2.2.2]oct-5-ene-2,3-dicarboxylic anhydride, endo-; Bicyclo[2.2.2]octene-2,3-endo-dicarboxylic anhydride; endo-Bicyclo[2.2.2]oct-5-ene-2,3-dicarboxylic anhydride; Bicyclo[3.2.1]-5-octene-2,3-dicarboxylic anhydride; endo-Bicyclo[2.2.2]-5-octene-2,3-dicarboxylic anhydride; Bicyclo[2,2,2]oct-5-ene-2,3-dicarboxylic anhydride, endo-

Phase change data

Data compiled as indicated in comments:
TRC - Thermodynamics Research Center, NIST Boulder Laboratories, Chris Muzny director
AC - William E. Acree, Jr., James S. Chickos
Quantity | Value | Units | Method | Reference | Comment |
---|---|---|---|---|---|
Ttriple | 419.2 | K | N/A | Weinstein, Leffler, et al., 1984 | Crystal phase 1 phase; Uncertainty assigned by TRC = 1.5 K; TRC |
Enthalpy of fusion
ΔfusH (kcal/mol) | Temperature (K) | Method | Reference | Comment |
---|---|---|---|---|
1.09 | 419.2 | DSC | Weinstein, Leffler, et al., 1984, 2 | AC |

References

Weinstein, Leffler, et al., 1984
Weinstein, D.I.; Leffler, A.J.; Currie, J.A.,
Phase Transitions in Bicyclic Compounds,
Mol. Cryst. Liq. Cryst., 1984, 104, 95. [all data]
Weinstein, Leffler, et al., 1984, 2
Weinstein, D.I.; Leffler, A.J.; Currie, J.A.,
Phase Transitions In Bicyclic Compounds,
Molecular Crystals and Liquid Crystals, 1984, 104, 1-2, 95-109, https://doi.org/10.1080/00268948408070401
. [all data]