Butanethioic acid, S-methyl ester
- Formula: C5H10OS
- Molecular weight: 118.197
- IUPAC Standard InChIKey: GRLJIIJNZJVMGP-UHFFFAOYSA-N
- CAS Registry Number: 2432-51-1
- Chemical structure:

Phase change data

Data compiled by: Robert L. Brown and Stephen E. Stein
Reduced pressure boiling point
Tboil (K) | Pressure (bar) | Reference |
---|---|---|
415.7 | 1.01 | Aldrich Chemical Company Inc., 1990 |

Kovats' RI, non-polar column, isothermal

Column type | Active phase | Temperature (C) | I | Reference | Comment |
---|---|---|---|---|---|
Packed | Apiezon M | 130. | 874. | Garbuzov, Misharina, et al., 1985 | He or N2, Chromosorb W, AW-DMCS; Column length: 2.1 m |
Packed | Apiezon M | 130. | 874. | Golovnya, Garbuzov, et al., 1981 | Chromosorb W, AW/DMCS; Column length: 2.1 m |

Van Den Dool and Kratz RI, polar column, custom temperature program

Column type | Active phase | I | Reference | Comment |
---|---|---|---|---|
Capillary | Supelcowax-10 | 1198. | Bianchi, Careri, et al., 2007 | 30. m/0.25 mm/0.25 μm, He; Program: 35C(8min) => 4C/min => 60C => 6C/min => 160C => 20C/min => 200C(1min) |

Normal alkane RI, non-polar column, temperature ramp

Column type | Active phase | I | Reference | Comment |
---|---|---|---|---|
Capillary | DB-1 | 867. | Kumazawa, Itobe, et al., 2008 | 30. m/0.25 mm/0.25 μm, He, 5. K/min; Tstart: 30. C; Tend: 210. C |
Capillary | OV-101 | 863. | Zenkevich, 2005 | 25. m/0.20 mm/0.10 μm, N2/He, 6. K/min; Tstart: 50. C; Tend: 250. C |

Normal alkane RI, non-polar column, custom temperature program

Column type | Active phase | I | Reference | Comment |
---|---|---|---|---|
Capillary | CP Sil 5 CB | 870. | Lermusieau, Bulens, et al., 2001 | 50. m/0.32 mm/1.2 μm; Program: 36C => 20C/min => 120C(20min) => 2C/min => 250C(30min) |
Capillary | CP Sil 5 CB | 869. | Gijs, Piraprez, et al., 2000 | 50. m/0.32 mm/1.2 μm, He; Program: 33C (16.5min) => 2C/min => 160C => 20C/min => 200C (9min) |

Normal alkane RI, polar column, temperature ramp

Column type | Active phase | I | Reference | Comment |
---|---|---|---|---|
Capillary | DB-Wax | 1215. | Kumazawa, Itobe, et al., 2008 | 30. m/0.25 mm/0.25 μm, He, 5. K/min; Tstart: 30. C; Tend: 210. C |

Normal alkane RI, polar column, custom temperature program

Column type | Active phase | I | Reference | Comment |
---|---|---|---|---|
Capillary | EC-1000 | 1195. | Delabre and Bendall, 9999 | Program: not specified |

References

Aldrich Chemical Company Inc., 1990
Aldrich Chemical Company Inc.,
Catalog Handbook of Fine Chemicals, Aldrich Chemical Company, Inc., Milwaukee WI, 1990, 1. [all data]
Garbuzov, Misharina, et al., 1985
Garbuzov, V.G.; Misharina, T.A.; Aerov, A.F.; Golovnya, R.V.,
Gas chromatographic retention indices for sulphur(II)-containing organic substances,
J. Anal. Chem. USSR (Engl. Transl.), 1985, 40, 4, 576-586. [all data]
Golovnya, Garbuzov, et al., 1981
Golovnya, R.V.; Garbuzov, V.G.; Aérov, A.F.,
Comparison of the retention indices and differential molar free energies of solution for thiolic and carboxylic esters on gas-chromatographic columns with various polarities,
Izv. Akad. Nauk SSSR Ser. Khim., 1981, 10, 1877-1880. [all data]
Bianchi, Careri, et al., 2007
Bianchi, F.; Careri, M.; Mangia, A.; Musci, M.,
Retention indices in the analysis of food aroma volatile compounds in temperature-programmed gas chromatography: Database creation and evaluation of precision and robustness,
J. Sep. Sci., 2007, 39, 4, 563-572, https://doi.org/10.1002/jssc.200600393
. [all data]
Kumazawa, Itobe, et al., 2008
Kumazawa, K.; Itobe, T.; Nishimura, O.; Hamaguchi, T.,
A new approach to estimate the in-mouth release characteristics of odorants in chewing gum,
Food Science and Technology Research, 2008, 14, 3, 269-276, https://doi.org/10.3136/fstr.14.269
. [all data]
Zenkevich, 2005
Zenkevich, I.G.,
Experimentally measured retention indices., 2005. [all data]
Lermusieau, Bulens, et al., 2001
Lermusieau, G.; Bulens, M.; Collin, S.,
Use of GC-olfactometry to identify the hop aromatic compounds in beer,
J. Agric. Food Chem., 2001, 49, 8, 3867-3874, https://doi.org/10.1021/jf0101509
. [all data]
Gijs, Piraprez, et al., 2000
Gijs, L.; Piraprez, G.; Perpète, P.; Spinnler, E.; Collin, S.,
Retention of sulfur flavours by food matrix and determination of sensorial data independent of the medium composition,
Food Chem., 2000, 69, 3, 319-330, https://doi.org/10.1016/S0956-7135(99)00111-5
. [all data]
Delabre and Bendall, 9999
Delabre, M.-L.; Bendall, J.F.,
Flavour ingredients from fermented dairy streams,
Expression of Multidisciplinary Flavour Sci., 9999, 375-378. [all data]