s-Ethyl thiopropionate
- Formula: C5H10OS
- Molecular weight: 118.197
- IUPAC Standard InChIKey: HNEVHBHRLCAKKQ-UHFFFAOYSA-N
- CAS Registry Number: 2432-42-0
- Chemical structure:
View 3d structure (requires JavaScript / HTML 5) - Other names: Ethyl thiopropionate; Propanethioic acid, S-ethyl ester; Thiopropionic acid, S-ethyl ester; S-ethyl propanethioate

Kovats' RI, non-polar column, isothermal

Column type | Active phase | Temperature (C) | I | Reference | Comment |
---|---|---|---|---|---|
Packed | Apiezon M | 130. | 849. | Garbuzov, Misharina, et al., 1985 | He or N2, Chromosorb W, AW-DMCS; Column length: 2.1 m |
Packed | Apiezon M | 130. | 849. | Golovnya, Garbuzov, et al., 1981 | Chromosorb W, AW/DMCS; Column length: 2.1 m |

Van Den Dool and Kratz RI, non-polar column, custom temperature program

Column type | Active phase | I | Reference | Comment |
---|---|---|---|---|
Capillary | VF-5MS | 872.9 | Tret'yakov, 2007 | 30. m/0.25 mm/0.25 μm, He; Program: Multi-step temperature program; T(initial)=60C; T(final)=270C |

Normal alkane RI, non-polar column, custom temperature program

Column type | Active phase | I | Reference | Comment |
---|---|---|---|---|
Capillary | CP Sil 5 CB | 846. | Gijs, Piraprez, et al., 2000 | 50. m/0.32 mm/1.2 μm, He; Program: 33C (16.5min) => 2C/min => 160C => 20C/min => 200C (9min) |

References

Garbuzov, Misharina, et al., 1985
Garbuzov, V.G.; Misharina, T.A.; Aerov, A.F.; Golovnya, R.V.,
Gas chromatographic retention indices for sulphur(II)-containing organic substances,
J. Anal. Chem. USSR (Engl. Transl.), 1985, 40, 4, 576-586. [all data]
Golovnya, Garbuzov, et al., 1981
Golovnya, R.V.; Garbuzov, V.G.; Aérov, A.F.,
Comparison of the retention indices and differential molar free energies of solution for thiolic and carboxylic esters on gas-chromatographic columns with various polarities,
Izv. Akad. Nauk SSSR Ser. Khim., 1981, 10, 1877-1880. [all data]
Tret'yakov, 2007
Tret'yakov, K.V.,
Retention Data. NIST Mass Spectrometry Data Center., NIST Mass Spectrometry Data Center, 2007. [all data]
Gijs, Piraprez, et al., 2000
Gijs, L.; Piraprez, G.; Perpète, P.; Spinnler, E.; Collin, S.,
Retention of sulfur flavours by food matrix and determination of sensorial data independent of the medium composition,
Food Chem., 2000, 69, 3, 319-330, https://doi.org/10.1016/S0956-7135(99)00111-5
. [all data]