Ethanethioic acid, S-(1-methylpropyl) ester
- Formula: C6H12OS
- Molecular weight: 132.224
- IUPAC Standard InChIKey: GZONFVAORVOWJX-UHFFFAOYSA-N
- CAS Registry Number: 2432-39-5
- Chemical structure:
View 3d structure (requires JavaScript / HTML 5) - Other names: Acetic acid, thio-, S-sec-butyl ester; S-(1-Methylpropyl) thioacetate; CH3C(O)SCH(CH3)C2H5

Phase change data

Data compiled by: Thermodynamics Research Center, NIST Boulder Laboratories, Chris Muzny director
Quantity | Value | Units | Method | Reference | Comment |
---|---|---|---|---|---|
Tboil | 423. | K | N/A | Dunbar and Bolstad, 1955 | Uncertainty assigned by TRC = 4. K |

Kovats' RI, non-polar column, isothermal

Column type | Active phase | Temperature (C) | I | Reference | Comment |
---|---|---|---|---|---|
Packed | Apiezon M | 130. | 895. | Garbuzov, Misharina, et al., 1985 | He or N2, Chromosorb W, AW-DMCS; Column length: 2.1 m |
Packed | Apiezon M | 130. | 895. | Golovnya, Garbuzov, et al., 1981 | Chromosorb W, AW/DMCS; Column length: 2.1 m |

References

Dunbar and Bolstad, 1955
Dunbar, R.E.; Bolstad, A.N.,
The Acetylation of Mercaptans with Ketene,
J. Am. Chem. Soc., 1955, 77, 4672. [all data]
Garbuzov, Misharina, et al., 1985
Garbuzov, V.G.; Misharina, T.A.; Aerov, A.F.; Golovnya, R.V.,
Gas chromatographic retention indices for sulphur(II)-containing organic substances,
J. Anal. Chem. USSR (Engl. Transl.), 1985, 40, 4, 576-586. [all data]
Golovnya, Garbuzov, et al., 1981
Golovnya, R.V.; Garbuzov, V.G.; Aérov, A.F.,
Comparison of the retention indices and differential molar free energies of solution for thiolic and carboxylic esters on gas-chromatographic columns with various polarities,
Izv. Akad. Nauk SSSR Ser. Khim., 1981, 10, 1877-1880. [all data]