[1,1':3',1''-Terphenyl]-2'-ol
- Formula: C18H14O
- Molecular weight: 246.3032
- IUPAC Standard InChIKey: ATGFTMUSEPZNJD-UHFFFAOYSA-N
- CAS Registry Number: 2432-11-3
- Chemical structure:
View 3d structure (requires JavaScript / HTML 5) - Other names: [m-Terphenyl]-2'-ol; 2,6-Diphenylphenol

Phase change data

Data compiled by: William E. Acree, Jr., James S. Chickos
Quantity | Value | Units | Method | Reference | Comment |
---|---|---|---|---|---|
ΔsubH° | 119.1 ± 1.1 | kJ/mol | GS | Verevkin, 1998 |
Enthalpy of sublimation
ΔsubH (kJ/mol) | Temperature (K) | Method | Reference | Comment |
---|---|---|---|---|
116.1 ± 1.1 | 348. | GS | Verevkin, 1998 | Based on data from 334. to 363. K. |

References

Verevkin, 1998
Verevkin, Sergey P.,
Thermochemistry of phenols: experimental standard molar enthalpies of formation of 2-phenylphenol, 4-phenylphenol, 2,6-diphenylphenol, and 2,2´- and 4,4´-dihydroxybiphenyl,
The Journal of Chemical Thermodynamics, 1998, 30, 3, 389-396, https://doi.org/10.1006/jcht.1997.0316
. [all data]