Pentane, 2-chloro-3-methyl
- Formula: C6H13Cl
- Molecular weight: 120.620
- IUPAC Standard InChIKey: JPFZKJQZKBEPGQ-UHFFFAOYSA-N
- CAS Registry Number: 24319-09-3
- Chemical structure:
View 3d structure (requires JavaScript / HTML 5) - Stereoisomers:

Reaction thermochemistry data

Data compiled by: Hussein Y. Afeefy, Joel F. Liebman, and Stephen E. Stein
Individual Reactions
By formula: C6H13Cl = C6H13Cl
Quantity | Value | Units | Method | Reference | Comment |
---|---|---|---|---|---|
ΔrH° | 3.6 | kJ/mol | Eqk | Andreevskii, Kabo, et al., 1974 | liquid phase; Isomerization |

Normal alkane RI, non-polar column, custom temperature program

Column type | Active phase | I | Reference | Comment |
---|---|---|---|---|
Capillary | Methyl Silicone | 787. | Zenkevich, 1999 | Program: not specified |

References

Andreevskii, Kabo, et al., 1974
Andreevskii, D.N.; Kabo, G.Ya.; Esipenok, G.E.,
Equilibria and thermodynamics of the isomerisation of methylchloropentanes,
Russ. J. Phys. Chem. (Engl. Transl.), 1974, 48, 955. [all data]
Zenkevich, 1999
Zenkevich, I.G.,
Mutual Correlation between Gas-Chromatographic Retention Indices of Organic Compounds from Different Series,
Zh. Anal. Khim., 1999, 54, 12, 1272-1279. [all data]