11H-Benzo[b]fluorene
- Formula: C17H12
- Molecular weight: 216.2772
- IUPAC Standard InChIKey: HAPOJKSPCGLOOD-UHFFFAOYSA-N
- CAS Registry Number: 243-17-4
- Chemical structure:
View 3d structure (requires JavaScript / HTML 5) - Species with the same structure:
- Other names: 2,3-Benzofluorene; 2,3-Benzfluorene; benzo[b]fluorene

Phase change data

Data compiled as indicated in comments:
BS - Robert L. Brown and Stephen E. Stein
TRC - Thermodynamics Research Center, NIST Boulder Laboratories, Chris Muzny director
AC - William E. Acree, Jr., James S. Chickos
DH - Eugene S. Domalski and Elizabeth D. Hearing
Quantity | Value | Units | Method | Reference | Comment |
---|---|---|---|---|---|
Tboil | 674.2 | K | N/A | Weast and Grasselli, 1989 | BS |
Tboil | 674. to 675. | K | N/A | Buckingham and Donaghy, 1982 | BS |
Quantity | Value | Units | Method | Reference | Comment |
Tfus | 481. to 482. | K | N/A | Buckingham and Donaghy, 1982 | BS |
Tfus | 489.7 | K | N/A | Farrell and Shahidi, 1979 | Uncertainty assigned by TRC = 0.4 K; TRC |
Tfus | 483.45 | K | N/A | Schuyer, Blom, et al., 1953 | Uncertainty assigned by TRC = 1. K; TRC |
Quantity | Value | Units | Method | Reference | Comment |
ΔvapH° | 97.5 ± 3.9 | kJ/mol | CGC | Hanshaw, Nutt, et al., 2008 | AC |
Enthalpy of vaporization
ΔvapH (kJ/mol) | Temperature (K) | Method | Reference | Comment |
---|---|---|---|---|
84.7 | 398. | GC | Lei, Chankalal, et al., 2002 | Based on data from 323. to 473. K.; AC |
Enthalpy of sublimation
ΔsubH (kJ/mol) | Temperature (K) | Method | Reference | Comment |
---|---|---|---|---|
119.3 ± 1.3 | 371. | ME | Oja and Suuberg, 1998 | Based on data from 344. to 398. K.; AC |
111.2 | 383. | GS | Nass, Lenoir, et al., 1995 | Based on data from 313. to 453. K.; AC |
Enthalpy of fusion
ΔfusH (kJ/mol) | Temperature (K) | Reference | Comment |
---|---|---|---|
23.400 | 489.7 | Farrell, Shahidi, et al., 1979 | DH |
23.4 | 489.7 | Domalski and Hearing, 1996 | AC |
Entropy of fusion
ΔfusS (J/mol*K) | Temperature (K) | Reference | Comment |
---|---|---|---|
47.8 | 489.7 | Farrell, Shahidi, et al., 1979 | DH |

References

Weast and Grasselli, 1989
CRC Handbook of Data on Organic Compounds, 2nd Editon, Weast,R.C and Grasselli, J.G., ed(s)., CRC Press, Inc., Boca Raton, FL, 1989, 1. [all data]
Buckingham and Donaghy, 1982
Buckingham, J.; Donaghy, S.M.,
Dictionary of Organic Compounds: Fifth Edition, Chapman and Hall, New York, 1982, 1. [all data]
Farrell and Shahidi, 1979
Farrell, P.G.; Shahidi, F.,
DSC studies of aromatic hydrocarbon picrates,
Thermochim. Acta, 1979, 33, 275. [all data]
Schuyer, Blom, et al., 1953
Schuyer, J.; Blom, L.; Van Krevelen, D.W.,
Molar refraction of condensed aromatic compounds.,
Trans. Faraday Soc., 1953, 49, 1391. [all data]
Hanshaw, Nutt, et al., 2008
Hanshaw, William; Nutt, Marjorie; Chickos, James S.,
Hypothetical Thermodynamic Properties. Subcooled Vaporization Enthalpies and Vapor Pressures of Polyaromatic Hydrocarbons,
J. Chem. Eng. Data, 2008, 53, 8, 1903-1913, https://doi.org/10.1021/je800300x
. [all data]
Lei, Chankalal, et al., 2002
Lei, Ying Duan; Chankalal, Raymond; Chan, Anita; Wania, Frank,
Supercooled Liquid Vapor Pressures of the Polycyclic Aromatic Hydrocarbons,
J. Chem. Eng. Data, 2002, 47, 4, 801-806, https://doi.org/10.1021/je0155148
. [all data]
Oja and Suuberg, 1998
Oja, Vahur; Suuberg, Eric M.,
Vapor Pressures and Enthalpies of Sublimation of Polycyclic Aromatic Hydrocarbons and Their Derivatives,
J. Chem. Eng. Data, 1998, 43, 3, 486-492, https://doi.org/10.1021/je970222l
. [all data]
Nass, Lenoir, et al., 1995
Nass, Karen; Lenoir, Dieter; Kettrup, Antonius,
Calculation of the Thermodynamic Properties of Polycyclic Aromatic Hydrocarbons by an Incremental Procedure,
Angew. Chem. Int. Ed. Engl., 1995, 34, 16, 1735-1736, https://doi.org/10.1002/anie.199517351
. [all data]
Farrell, Shahidi, et al., 1979
Farrell, P.G.; Shahidi, F.; Casellato, F.; Vecchi, C.; Girelli, A.,
DSC studies of aromatic hydrocarbon picrates,
Thermochim. Acta, 1979, 33, 275-280. [all data]
Domalski and Hearing, 1996
Domalski, Eugene S.; Hearing, Elizabeth D.,
Heat Capacities and Entropies of Organic Compounds in the Condensed Phase. Volume III,
J. Phys. Chem. Ref. Data, 1996, 25, 1, 1, https://doi.org/10.1063/1.555985
. [all data]
Shuikin, Erivanskaya, et al., 1963
Shuikin, N.I.; Erivanskaya, A.A.; Ai-Si, Y.; Romanova, A.R.,
Catalytic dehydrocyclization of 2-n-octylnaphthalene,
Izv. Akad. Nauk SSSR, Ser. Khim., 1963, 1469-1474. [all data]