ScF2+
- Formula: F2Sc+
- Molecular weight: 82.952170
- CAS Registry Number: 24305-96-2

Reaction thermochemistry data

Data compiled by: Michael M. Meot-Ner (Mautner) and Sharon G. Lias
Individual Reactions
By formula: (F2Sc+ • 2FNa) + FNa = (F2Sc+ • 3FNa)
Quantity | Value | Units | Method | Reference | Comment |
---|---|---|---|---|---|
ΔrH° | 72. | kcal/mol | MS | Tsirlina, Gusarov, et al., 1986 | gas phase; Knudsen cell |
By formula: (F2Sc+ • 3FNa) + FNa = (F2Sc+ • 4FNa)
Quantity | Value | Units | Method | Reference | Comment |
---|---|---|---|---|---|
ΔrH° | 67. | kcal/mol | MS | Tsirlina, Gusarov, et al., 1986 | gas phase; Knudsen cell |
By formula: (F2Sc+ • FNa) + FNa = (F2Sc+ • 2FNa)
Quantity | Value | Units | Method | Reference | Comment |
---|---|---|---|---|---|
ΔrH° | 83. | kcal/mol | MS | Tsirlina, Gusarov, et al., 1986 | gas phase; Knudsen cell |

Ion clustering data

Data compiled by: Michael M. Meot-Ner (Mautner) and Sharon G. Lias
Clustering reactions
By formula: (F2Sc+ • FNa) + FNa = (F2Sc+ • 2FNa)
Quantity | Value | Units | Method | Reference | Comment |
---|---|---|---|---|---|
ΔrH° | 83. | kcal/mol | MS | Tsirlina, Gusarov, et al., 1986 | gas phase; Knudsen cell |
By formula: (F2Sc+ • 2FNa) + FNa = (F2Sc+ • 3FNa)
Quantity | Value | Units | Method | Reference | Comment |
---|---|---|---|---|---|
ΔrH° | 72. | kcal/mol | MS | Tsirlina, Gusarov, et al., 1986 | gas phase; Knudsen cell |
By formula: (F2Sc+ • 3FNa) + FNa = (F2Sc+ • 4FNa)
Quantity | Value | Units | Method | Reference | Comment |
---|---|---|---|---|---|
ΔrH° | 67. | kcal/mol | MS | Tsirlina, Gusarov, et al., 1986 | gas phase; Knudsen cell |

References

Tsirlina, Gusarov, et al., 1986
Tsirlina, E.A.; Gusarov, A.V.; Gorokhov, L.N.,
High Temp., 1986, 14, 1064. [all data]