aluminium nitride
- Formula: AlN
- Molecular weight: 40.9882
- IUPAC Standard InChIKey: PIGFYZPCRLYGLF-UHFFFAOYSA-N
- CAS Registry Number: 24304-00-5
- Chemical structure:
View 3d structure (requires JavaScript / HTML 5) - Other names: Aluminum nitride

Gas phase thermochemistry data

Quantity | Value | Units | Method | Reference | Comment |
---|---|---|---|---|---|
ΔfH°gas | 523.00 | kJ/mol | Review | Chase, 1998 | Data last reviewed in December, 1979 |
Quantity | Value | Units | Method | Reference | Comment |
S°gas,1 bar | 228.50 | J/mol*K | Review | Chase, 1998 | Data last reviewed in December, 1979 |
Gas Phase Heat Capacity (Shomate Equation)
Cp° = A + B*t + C*t2 + D*t3 +
E/t2
H° − H°298.15= A*t + B*t2/2 +
C*t3/3 + D*t4/4 − E/t + F − H
S° = A*ln(t) + B*t + C*t2/2 + D*t3/3 −
E/(2*t2) + G
Cp = heat capacity (J/mol*K)
H° = standard enthalpy (kJ/mol)
S° = standard entropy (J/mol*K)
t = temperature (K) / 1000.
View plot Requires a JavaScript / HTML 5 canvas capable browser.
Temperature (K) | 298. to 6000. |
---|---|
A | 36.21495 |
B | 1.462133 |
C | -0.283742 |
D | 0.033794 |
E | -0.397324 |
F | 510.8078 |
G | 269.6701 |
H | 523.0000 |
Reference | Chase, 1998 |
Comment | Data last reviewed in December, 1979 |

Condensed phase thermochemistry data

Quantity | Value | Units | Method | Reference | Comment |
---|---|---|---|---|---|
ΔfH°solid | -317.98 | kJ/mol | Review | Chase, 1998 | Data last reviewed in December, 1979 |
Quantity | Value | Units | Method | Reference | Comment |
S°solid | 20.14 | J/mol*K | Review | Chase, 1998 | Data last reviewed in December, 1979 |
Solid Phase Heat Capacity (Shomate Equation)
Cp° = A + B*t + C*t2 + D*t3 +
E/t2
H° − H°298.15= A*t + B*t2/2 +
C*t3/3 + D*t4/4 − E/t + F − H
S° = A*ln(t) + B*t + C*t2/2 + D*t3/3 −
E/(2*t2) + G
Cp = heat capacity (J/mol*K)
H° = standard enthalpy (kJ/mol)
S° = standard entropy (J/mol*K)
t = temperature (K) / 1000.
View plot Requires a JavaScript / HTML 5 canvas capable browser.
Temperature (K) | 298. to 900. | 900. to 3000. |
---|---|---|
A | 17.23264 | 49.78374 |
B | 85.63811 | 2.238047 |
C | -83.27290 | -0.742003 |
D | 29.63427 | 0.087952 |
E | -0.537933 | -2.813004 |
F | -328.0587 | -341.3173 |
G | 15.87020 | 66.70509 |
H | -317.9844 | -317.9844 |
Reference | Chase, 1998 | Chase, 1998 |
Comment | Data last reviewed in December, 1979 | Data last reviewed in December, 1979 |

Constants of diatomic molecules

Data compiled by: Klaus P. Huber and Gerhard H. Herzberg
Data collected through December, 1975
Symbol | Meaning |
---|---|
State | electronic state and / or symmetry symbol |
Te | minimum electronic energy (cm-1) |
ωe | vibrational constant – first term (cm-1) |
ωexe | vibrational constant – second term (cm-1) |
ωeye | vibrational constant – third term (cm-1) |
Be | rotational constant in equilibrium position (cm-1) |
αe | rotational constant – first term (cm-1) |
γe | rotation-vibration interaction constant (cm-1) |
De | centrifugal distortion constant (cm-1) |
βe | rotational constant – first term, centrifugal force (cm-1) |
re | internuclear distance (Å) |
Trans. | observed transition(s) corresponding to electronic state |
ν00 | position of 0-0 band (units noted in table) |
State | Te | ωe | ωexe | ωeye | Be | αe | γe | De | βe | re | Trans. | ν00 |
---|---|---|---|---|---|---|---|---|---|---|---|---|
A 3Πi | 1 | [0.5811] 2 3 | [0.00000139] | [1.7739] | A → X V | 19727.37 Z | ||||||
↳missing citation | ||||||||||||
(X) 3Πi | 0 4 5 | [746.93] Z | 0.5730 2 | 0.0056 | [0.00000136] | 1.7864 |

References

Chase, 1998
Chase, M.W., Jr.,
NIST-JANAF Themochemical Tables, Fourth Edition,
J. Phys. Chem. Ref. Data, Monograph 9, 1998, 1-1951. [all data]