3,4,5,6-Tetrahydrophthalic anhydride
- Formula: C8H8O3
- Molecular weight: 152.1473
- IUPAC Standard InChIKey: HMMBJOWWRLZEMI-UHFFFAOYSA-N
- CAS Registry Number: 2426-02-0
- Chemical structure:
View 3d structure (requires JavaScript / HTML 5) - Other names: Tetrahydrophthalic anhydride; 1,3-Isobenzofurandione, 4,5,6,7-tetrahydro-; 1-Cyclohexene-1,2-dicarboxylic anhydride

Phase change data

Data compiled as indicated in comments:
BS - Robert L. Brown and Stephen E. Stein
AC - William E. Acree, Jr., James S. Chickos
Reduced pressure boiling point
Tboil (K) | Pressure (bar) | Reference | Comment |
---|---|---|---|
441. to 443. | 0.033 | Frinton Laboratories Inc., 1986 | BS |
Enthalpy of fusion
ΔfusH (kJ/mol) | Temperature (K) | Method | Reference | Comment |
---|---|---|---|---|
11.88 | 343.5 | AC | Lv, Tan, et al., 2004 | Based on data from 80. to 360. K.; AC |

References

Frinton Laboratories Inc., 1986
Frinton Laboratories Inc.,
Catalog Number 11, Frinton Laboratories Inc., Vineland, NJ, 1986, 99. [all data]
Lv, Tan, et al., 2004
Lv, Xue-Chuan; Tan, Zhi-Cheng; Di, You-Ying; Shi, Quan; Sun, Li-Xian; Zhang, Tao,
Molar heat capacity and thermodynamic properties of 1-cyclohexene-1,2-dicarboxylic anhydride [C8H8O3],
The Journal of Chemical Thermodynamics, 2004, 36, 9, 787-792, https://doi.org/10.1016/j.jct.2004.05.008
. [all data]