Captafol
- Formula: C10H9Cl4NO2S
- Molecular weight: 349.061
- IUPAC Standard InChIKey: JHRWWRDRBPCWTF-UHFFFAOYSA-N
- CAS Registry Number: 2425-06-1
- Chemical structure:
View 3d structure (requires JavaScript / HTML 5) - Stereoisomers:
- Other names: 4-Cyclohexene-1,2-dicarboximide, N-[(1,1,2,2-tetrachloroethyl)thio]-; (Tetrachloroethylthio)tetrahydrophthalimide; CS 5623; Difolatan; Difolatan 4F1; Folcid; N-(Tetrachloroethylthio)tetrahydrophthalimide; Ortho 5,865; Captatol; Captofol; Difosan; Ortho 5865; Sanspor; Sulfonimide; Sulpheimide; N-(1,1,2,2-Tetrachloraethylthio)-cyclohex-4-en-1,4-diacarboximid; N-(1,1,2,2-Tetrachloraethylthio)-tetrahydrophthalamid; N-1,1,2,2-Tetrachloroethylmercapto-4-cyclohexene-1,2-carboximide; N-((1,1,2,2-Tetrachloroethyl)sulfenyl)-cis-4-cyclohexene-1,2-dicarboximide; N-(1,1,2,2-Tetrachloroethylthio)-4-cyclohexene-1,2-dicarboximide; 3a,4,7,7a-Tetrahydro-2-[(1,1,2,2-tetrachloroethyl)thio]-1H-isoindole-1,3(2H)-dione; Merpafol; Alfloc 7020; Alfloc 7046; Arborseal; Difolatan 4F; Difolatan 80W; Difolatan BOW; Foltaf; Haipen 50; N-(1,1,2,2-Tetrachloroethylthio)-Δ4-tetrahydrophthalimide; Nalco 7046; Proxel EF; Santar SM; Terrazol

Phase change data

Data compiled as indicated in comments:
TRC - Thermodynamics Research Center, NIST Boulder Laboratories, Chris Muzny director
AC - William E. Acree, Jr., James S. Chickos
Quantity | Value | Units | Method | Reference | Comment |
---|---|---|---|---|---|
Tfus | 432.81 | K | N/A | Donnelly, Drewes, et al., 1990 | Uncertainty assigned by TRC = 0.2 K; TRC |
Tfus | 432.0 | K | N/A | Plato and Glasgow, 1969 | Uncertainty assigned by TRC = 0.2 K; TRC |
Enthalpy of fusion
ΔfusH (kJ/mol) | Temperature (K) | Method | Reference | Comment |
---|---|---|---|---|
40.22 | 432.7 | DSC | Donnelly, Drewes, et al., 1990, 2 | AC |
43.1 | 432. | DSC | Plato and Glasgow, 1969, 2 | AC |

References

Donnelly, Drewes, et al., 1990
Donnelly, J.R.; Drewes, L.A.; Johnson, R.L.; Munslow, W.D.; Knapp, K.K.; Sovocool, G.W.,
Purity and heat of fusion data for environmental standards as determined by differential scanning calorimetry,
Thermochim. Acta, 1990, 167, 2, 155, https://doi.org/10.1016/0040-6031(90)80476-F
. [all data]
Plato and Glasgow, 1969
Plato, C.; Glasgow, A.R., Jr.,
Differential scanning calorimetry as a general method for determining the purity and heat of fusion of high-purity organic chemicals. Application to 95 compounds,
Anal. Chem., 1969, 41, 2, 330, https://doi.org/10.1021/ac60271a041
. [all data]
Donnelly, Drewes, et al., 1990, 2
Donnelly, J.R.; Drewes, L.A.; Johnson, R.L.; Munslow, W.D.; Knapp, K.K.; Sovocool, G.W.,
Purity and heat of fusion data for environmental standards as determined by differential scanning calorimetry,
Thermochimica Acta, 1990, 167, 2, 155-187, https://doi.org/10.1016/0040-6031(90)80476-F
. [all data]
Plato and Glasgow, 1969, 2
Plato, Candace.; Glasgow, Augustus R.,
Differential scanning calorimetry as a general method for determining the purity and heat of fusion of high-purity organic chemicals. Application to 95 compounds,
Anal. Chem., 1969, 41, 2, 330-336, https://doi.org/10.1021/ac60271a041
. [all data]