Propanoic acid, 2-methyl-, ethenyl ester
- Formula: C6H10O2
- Molecular weight: 114.1424
- IUPAC Standard InChIKey: WNMORWGTPVWAIB-UHFFFAOYSA-N
- CAS Registry Number: 2424-98-8
- Chemical structure:
View 3d structure (requires JavaScript / HTML 5) - Other names: Isobutyric acid, vinyl ester; vinyl isobutyrate

Phase change data

Data compiled by: Thermodynamics Research Center, NIST Boulder Laboratories, Chris Muzny director
Quantity | Value | Units | Method | Reference | Comment |
---|---|---|---|---|---|
Tfus | 178.2 | K | N/A | Anonymous, 1957 | Uncertainty assigned by TRC = 0.6 K |

References

Anonymous, 1957
Anonymous, R.,
, Am. Pet. Inst. Res. Proj. 6, Carnegie-Mellon Univ., 1957. [all data]