2-Propen-1-amine, N-ethyl-
- Formula: C5H11N
- Molecular weight: 85.1475
- IUPAC Standard InChIKey: PUUULGNNRPBVBA-UHFFFAOYSA-N
- CAS Registry Number: 2424-02-4
- Chemical structure:
View 3d structure (requires JavaScript / HTML 5) - Other names: Allylethylamine; N-ethylallylamine

Normal alkane RI, non-polar column, temperature ramp

Column type | Active phase | I | Reference | Comment |
---|---|---|---|---|
Capillary | OV-101 | 640. | Zenkevich, 2005 | 25. m/0.20 mm/0.10 μm, N2/He, 6. K/min; Tstart: 50. C; Tend: 250. C |

References

Zenkevich, 2005
Zenkevich, I.G.,
Experimentally measured retention indices., 2005. [all data]