Mianserin

Kovats' RI, non-polar column, isothermal

View large format table.

Column type Active phase Temperature (C) I Reference Comment
PackedSE-30240.2207.Musumarra, Scarlata, et al., 1987N2, 1% se-30 on Anachrom ABS(80-100mesh); Column length: 2. m

Normal alkane RI, non-polar column, custom temperature program

View large format table.

Column type Active phase I Reference Comment
PackedOV-1012208.Maurer and Pfleger, 1984Program: not specified

References

Musumarra, Scarlata, et al., 1987
Musumarra, G.; Scarlata, G.; Romano, G.; Cappello, G.; Clementi, S.; Giulietti, G., Qualitative organic analysis. Part 2. Identification of drugs by principal components analysis of standardized TLC data in four eluent systems and of retention indices on SE 30, J. Anal. Toxicol., 1987, 11, 4, 154-163, https://doi.org/10.1093/jat/11.4.154 . [all data]

Maurer and Pfleger, 1984
Maurer, H.; Pfleger, K., Screening procedure for detection of antidepressants and their metabolites in urine using a computerized gas chromatographic-mass spectrometric technique, J. Chromatogr., 1984, 305, 309-323, https://doi.org/10.1016/S0378-4347(00)83345-9 . [all data]