Potassium ion (1+)
- Formula: K+
- Molecular weight: 39.0978
- IUPAC Standard InChIKey: NPYPAHLBTDXSSS-UHFFFAOYSA-N
- CAS Registry Number: 24203-36-9
- Chemical structure:
- Gas phase thermochemistry data
- Reaction thermochemistry data: reactions 51 to 100, reactions 101 to 145

Reaction thermochemistry data

Data compiled as indicated in comments:
M - Michael M. Meot-Ner (Mautner) and Sharon G. Lias
RCD - Robert C. Dunbar
Reactions 1 to 50
By formula: K+ + H2O = (K+ • H2O)
Quantity | Value | Units | Method | Reference | Comment |
---|---|---|---|---|---|
ΔrH° | 70.7 | kJ/mol | HPMS | Davidson and Kebarle, 1976 | gas phase; M |
ΔrH° | 70. ± 10. | kJ/mol | HPMS | Blades, Jayaweera, et al., 1990 | gas phase; electospray, Entropy change calculated or estimated; M |
ΔrH° | 81. ± 10. | kJ/mol | MS | Burdett and Hayhurst, 1982 | gas phase; flame source, about 1600 K; M |
ΔrH° | 74.9 | kJ/mol | HPMS | Searles and Kebarle, 1969 | gas phase; M |
Quantity | Value | Units | Method | Reference | Comment |
ΔrS° | 83.3 | J/mol*K | HPMS | Davidson and Kebarle, 1976 | gas phase; M |
ΔrS° | 96. | J/mol*K | N/A | Blades, Jayaweera, et al., 1990 | gas phase; electospray, Entropy change calculated or estimated; M |
ΔrS° | 89.1 | J/mol*K | MS | Burdett and Hayhurst, 1982 | gas phase; flame source, about 1600 K; M |
ΔrS° | 90.4 | J/mol*K | HPMS | Searles and Kebarle, 1969 | gas phase; M |
Free energy of reaction
ΔrG° (kJ/mol) | T (K) | Method | Reference | Comment |
---|---|---|---|---|
38. | 300. | HPMS | Blades, Jayaweera, et al., 1990 | gas phase; electospray, Entropy change calculated or estimated; M |
2. | 840. | MS | Chupka, 1959 | gas phase; Knudsen cell, 840+-50K; M |
By formula: (K+ • 2H2O) + H2O = (K+ • 3H2O)
Quantity | Value | Units | Method | Reference | Comment |
---|---|---|---|---|---|
ΔrH° | 54.4 | kJ/mol | ES/HPMS | Blades, Klassen, et al., 1996 | gas phase; M |
ΔrH° | 60. ± 10. | kJ/mol | HPMS | Blades, Jayaweera, et al., 1990 | gas phase; electospray, Entropy change calculated or estimated; M |
ΔrH° | 55.2 | kJ/mol | HPMS | Searles and Kebarle, 1969 | gas phase; M |
Quantity | Value | Units | Method | Reference | Comment |
ΔrS° | 94.1 | J/mol*K | ES/HPMS | Blades, Klassen, et al., 1996 | gas phase; M |
ΔrS° | 96. | J/mol*K | N/A | Blades, Jayaweera, et al., 1990 | gas phase; electospray, Entropy change calculated or estimated; M |
ΔrS° | 96.2 | J/mol*K | HPMS | Searles and Kebarle, 1969 | gas phase; M |
Quantity | Value | Units | Method | Reference | Comment |
ΔrG° | 26. | kJ/mol | ES/HPMS | Blades, Klassen, et al., 1996 | gas phase; M |
Free energy of reaction
ΔrG° (kJ/mol) | T (K) | Method | Reference | Comment |
---|---|---|---|---|
28. | 300. | HPMS | Blades, Jayaweera, et al., 1990 | gas phase; electospray, Entropy change calculated or estimated; M |
By formula: K+ + Ar = (K+ • Ar)
Quantity | Value | Units | Method | Reference | Comment |
---|---|---|---|---|---|
ΔrH° | 12. ± 3. | kJ/mol | AVG | N/A | Average of 9 values; Individual data points |
By formula: (K+ • 3H2O) + H2O = (K+ • 4H2O)
Quantity | Value | Units | Method | Reference | Comment |
---|---|---|---|---|---|
ΔrH° | 50. ± 10. | kJ/mol | HPMS | Blades, Jayaweera, et al., 1990 | gas phase; electospray, Entropy change calculated or estimated; M |
ΔrH° | 49.4 | kJ/mol | HPMS | Searles and Kebarle, 1969 | gas phase; M |
Quantity | Value | Units | Method | Reference | Comment |
ΔrS° | 96. | J/mol*K | N/A | Blades, Jayaweera, et al., 1990 | gas phase; electospray, Entropy change calculated or estimated; M |
ΔrS° | 103. | J/mol*K | HPMS | Searles and Kebarle, 1969 | gas phase; M |
Free energy of reaction
ΔrG° (kJ/mol) | T (K) | Method | Reference | Comment |
---|---|---|---|---|
25. | 300. | HPMS | Blades, Jayaweera, et al., 1990 | gas phase; electospray, Entropy change calculated or estimated; M |
By formula: (K+ • H2O) + H2O = (K+ • 2H2O)
Quantity | Value | Units | Method | Reference | Comment |
---|---|---|---|---|---|
ΔrH° | 70. ± 10. | kJ/mol | HPMS | Blades, Jayaweera, et al., 1990 | gas phase; electospray, Entropy change calculated or estimated; M |
ΔrH° | 67.4 | kJ/mol | HPMS | Searles and Kebarle, 1969 | gas phase; M |
Quantity | Value | Units | Method | Reference | Comment |
ΔrS° | 96. | J/mol*K | N/A | Blades, Jayaweera, et al., 1990 | gas phase; electospray, Entropy change calculated or estimated; M |
ΔrS° | 101. | J/mol*K | HPMS | Searles and Kebarle, 1969 | gas phase; M |
Free energy of reaction
ΔrG° (kJ/mol) | T (K) | Method | Reference | Comment |
---|---|---|---|---|
38. | 300. | HPMS | Blades, Jayaweera, et al., 1990 | gas phase; electospray, Entropy change calculated or estimated; M |
By formula: K+ + CH5N = (K+ • CH5N)
Quantity | Value | Units | Method | Reference | Comment |
---|---|---|---|---|---|
ΔrH° | 79.9 | kJ/mol | HPMS | Davidson and Kebarle, 1976, 2 | gas phase; switching reaction(K+)H2O; Davidson and Kebarle, 1976; M |
Quantity | Value | Units | Method | Reference | Comment |
ΔrS° | 91.2 | J/mol*K | HPMS | Davidson and Kebarle, 1976, 2 | gas phase; switching reaction(K+)H2O; Davidson and Kebarle, 1976; M |
Quantity | Value | Units | Method | Reference | Comment |
ΔrG° | 53.1 | kJ/mol | HPMS | Davidson and Kebarle, 1976, 2 | gas phase; switching reaction(K+)H2O; Davidson and Kebarle, 1976; M |
By formula: K+ + C3H9N = (K+ • C3H9N)
Quantity | Value | Units | Method | Reference | Comment |
---|---|---|---|---|---|
ΔrH° | 83.7 | kJ/mol | HPMS | Davidson and Kebarle, 1976, 2 | gas phase; switching reaction(K+)H2O; Davidson and Kebarle, 1976; M |
Quantity | Value | Units | Method | Reference | Comment |
ΔrS° | 97.9 | J/mol*K | HPMS | Davidson and Kebarle, 1976, 2 | gas phase; switching reaction(K+)H2O; Davidson and Kebarle, 1976; M |
Quantity | Value | Units | Method | Reference | Comment |
ΔrG° | 54.4 | kJ/mol | HPMS | Davidson and Kebarle, 1976, 2 | gas phase; switching reaction(K+)H2O; Davidson and Kebarle, 1976; M |
By formula: (K+ • C6H6 • H2O) + C6H6 = (K+ • 2C6H6 • H2O)
Quantity | Value | Units | Method | Reference | Comment |
---|---|---|---|---|---|
ΔrH° | 60.2 | kJ/mol | HPMS | Sunner, Nishizawa, et al., 1981 | gas phase; From thermochemical cycle,switching reaction(K+ 3H2O)C6H6, Searles and Kebarle, 1969; M |
Quantity | Value | Units | Method | Reference | Comment |
ΔrS° | 126. | J/mol*K | HPMS | Sunner, Nishizawa, et al., 1981 | gas phase; From thermochemical cycle,switching reaction(K+ 3H2O)C6H6, Searles and Kebarle, 1969; M |
By formula: (K+ • 2H2O • C6H6) + H2O = (K+ • 3H2O • C6H6)
Quantity | Value | Units | Method | Reference | Comment |
---|---|---|---|---|---|
ΔrH° | 49.4 | kJ/mol | HPMS | Sunner, Nishizawa, et al., 1981 | gas phase; From thermochemical cycle,switching reaction(K+)4H2O; Searles and Kebarle, 1969; M |
Quantity | Value | Units | Method | Reference | Comment |
ΔrS° | 110. | J/mol*K | HPMS | Sunner, Nishizawa, et al., 1981 | gas phase; From thermochemical cycle,switching reaction(K+)4H2O; Searles and Kebarle, 1969; M |
By formula: K+ + C2H6O = (K+ • C2H6O)
Quantity | Value | Units | Method | Reference | Comment |
---|---|---|---|---|---|
ΔrH° | 72.8 ± 4.2 | kJ/mol | CIDT | Rodgers and Armentrout, 2000 | RCD |
ΔrH° | 92.9 | kJ/mol | HPMS | Davidson and Kebarle, 1976, 3 | gas phase; M |
ΔrH° | 87.0 | kJ/mol | HPMS | Davidson and Kebarle, 1976, 2 | gas phase; M |
Quantity | Value | Units | Method | Reference | Comment |
ΔrS° | 112. | J/mol*K | HPMS | Davidson and Kebarle, 1976, 3 | gas phase; M |
ΔrS° | 104. | J/mol*K | HPMS | Davidson and Kebarle, 1976, 2 | gas phase; M |
By formula: (K+ • H2O • C6H6) + H2O = (K+ • 2H2O • C6H6)
Quantity | Value | Units | Method | Reference | Comment |
---|---|---|---|---|---|
ΔrH° | 53.1 | kJ/mol | HPMS | Sunner, Nishizawa, et al., 1981 | gas phase; From thermochemical cycle,switching reaction(K+)3H2O; Searles and Kebarle, 1969; M |
Quantity | Value | Units | Method | Reference | Comment |
ΔrS° | 89.5 | J/mol*K | HPMS | Sunner, Nishizawa, et al., 1981 | gas phase; From thermochemical cycle,switching reaction(K+)3H2O; Searles and Kebarle, 1969; M |
By formula: (K+ • H2O • 2C6H6) + H2O = (K+ • 2H2O • 2C6H6)
Quantity | Value | Units | Method | Reference | Comment |
---|---|---|---|---|---|
ΔrH° | 51.0 | kJ/mol | HPMS | Sunner, Nishizawa, et al., 1981 | gas phase; From thermochemical cycle(K+ 3H2O)C6H6; Searles and Kebarle, 1969; M |
Quantity | Value | Units | Method | Reference | Comment |
ΔrS° | 123. | J/mol*K | HPMS | Sunner, Nishizawa, et al., 1981 | gas phase; From thermochemical cycle(K+ 3H2O)C6H6; Searles and Kebarle, 1969; M |
By formula: (K+ • C6H6 • 2H2O) + C6H6 = (K+ • 2C6H6 • 2H2O)
Quantity | Value | Units | Method | Reference | Comment |
---|---|---|---|---|---|
ΔrH° | 53.6 | kJ/mol | HPMS | Sunner, Nishizawa, et al., 1981 | gas phase; switching reaction(K+ 3H2O)C6H6; Searles and Kebarle, 1969; M |
Quantity | Value | Units | Method | Reference | Comment |
ΔrS° | 141. | J/mol*K | HPMS | Sunner, Nishizawa, et al., 1981 | gas phase; switching reaction(K+ 3H2O)C6H6; Searles and Kebarle, 1969; M |
By formula: (K+ • 2C6H6) + H2O = (K+ • H2O • 2C6H6)
Quantity | Value | Units | Method | Reference | Comment |
---|---|---|---|---|---|
ΔrH° | 57.3 | kJ/mol | HPMS | Sunner, Nishizawa, et al., 1981 | gas phase; switching reaction(K+ 2H2O)C6H6; Searles and Kebarle, 1969; M |
Quantity | Value | Units | Method | Reference | Comment |
ΔrS° | 109. | J/mol*K | HPMS | Sunner, Nishizawa, et al., 1981 | gas phase; switching reaction(K+ 2H2O)C6H6; Searles and Kebarle, 1969; M |
By formula: (K+ • C6H6) + H2O = (K+ • H2O • C6H6)
Quantity | Value | Units | Method | Reference | Comment |
---|---|---|---|---|---|
ΔrH° | 75.7 | kJ/mol | HPMS | Sunner, Nishizawa, et al., 1981 | gas phase; switching reaction(K+ C6H6)C6H6; Searles and Kebarle, 1969; M |
Quantity | Value | Units | Method | Reference | Comment |
ΔrS° | 125. | J/mol*K | HPMS | Sunner, Nishizawa, et al., 1981 | gas phase; switching reaction(K+ C6H6)C6H6; Searles and Kebarle, 1969; M |
By formula: K+ + C4H10O2 = (K+ • C4H10O2)
Bond type: Polydentate bonding in non-hydrogen-bonded positive ions
Quantity | Value | Units | Method | Reference | Comment |
---|---|---|---|---|---|
ΔrH° | 119. ± 4.2 | kJ/mol | CIDT | Rodgers and Armentrout, 2000 | RCD |
ΔrH° | 129. | kJ/mol | HPMS | Davidson and Kebarle, 1976, 3 | gas phase; M |
Quantity | Value | Units | Method | Reference | Comment |
ΔrS° | 112. | J/mol*K | HPMS | Davidson and Kebarle, 1976, 3 | gas phase; M |
By formula: (K+ • 2H2O) + C6H6 = (K+ • C6H6 • 2H2O)
Quantity | Value | Units | Method | Reference | Comment |
---|---|---|---|---|---|
ΔrH° | 56.1 | kJ/mol | HPMS | Sunner, Nishizawa, et al., 1981 | gas phase; switching reaction(K+)3H2O; Searles and Kebarle, 1969; M |
Quantity | Value | Units | Method | Reference | Comment |
ΔrS° | 102. | J/mol*K | HPMS | Sunner, Nishizawa, et al., 1981 | gas phase; switching reaction(K+)3H2O; Searles and Kebarle, 1969; M |
By formula: (K+ • 3H2O) + C6H6 = (K+ • C6H6 • 3H2O)
Quantity | Value | Units | Method | Reference | Comment |
---|---|---|---|---|---|
ΔrH° | 52.7 | kJ/mol | HPMS | Sunner, Nishizawa, et al., 1981 | gas phase; switching reaction(K+)4H2O; Searles and Kebarle, 1969; M |
Quantity | Value | Units | Method | Reference | Comment |
ΔrS° | 115. | J/mol*K | HPMS | Sunner, Nishizawa, et al., 1981 | gas phase; switching reaction(K+)4H2O; Searles and Kebarle, 1969; M |
By formula: (K+ • H2O) + C6H6 = (K+ • C6H6 • H2O)
Quantity | Value | Units | Method | Reference | Comment |
---|---|---|---|---|---|
ΔrH° | 70.3 | kJ/mol | HPMS | Sunner, Nishizawa, et al., 1981 | gas phase; switching reaction(K+)2H2O; Searles and Kebarle, 1969; M |
Quantity | Value | Units | Method | Reference | Comment |
ΔrS° | 113. | J/mol*K | HPMS | Sunner, Nishizawa, et al., 1981 | gas phase; switching reaction(K+)2H2O; Searles and Kebarle, 1969; M |
By formula: K+ + H3N = (K+ • H3N)
Quantity | Value | Units | Method | Reference | Comment |
---|---|---|---|---|---|
ΔrH° | 84.1 | kJ/mol | HPMS | Castleman, 1978 | gas phase; M |
ΔrH° | 74.5 | kJ/mol | HPMS | Davidson and Kebarle, 1976, 2 | gas phase; M |
Quantity | Value | Units | Method | Reference | Comment |
ΔrS° | 96.2 | J/mol*K | HPMS | Castleman, 1978 | gas phase; M |
ΔrS° | 117. | J/mol*K | HPMS | Davidson and Kebarle, 1976, 2 | gas phase; M |
By formula: K+ + Kr = (K+ • Kr)
Quantity | Value | Units | Method | Reference | Comment |
---|---|---|---|---|---|
ΔrH° | 13.4 | kJ/mol | IMob | Gatland, 1984 | gas phase; M |
ΔrH° | 12.1 | kJ/mol | SCATTERING | Gislason, 1984 | gas phase; M |
ΔrH° | 12.3 | kJ/mol | IMob | Viehland, 1984 | gas phase; M |
ΔrH° | 15.5 | kJ/mol | IMob | Takebe, 1983 | gas phase; M |
By formula: K+ + Ne = (K+ • Ne)
Quantity | Value | Units | Method | Reference | Comment |
---|---|---|---|---|---|
ΔrH° | 4.56 | kJ/mol | SCATTERING | Gislason, 1984 | gas phase; M |
ΔrH° | 3.8 | kJ/mol | IMob | Viehland, 1984 | gas phase; M |
ΔrH° | 4.0 | kJ/mol | IMob | Takebe, 1983 | gas phase; M |
ΔrH° | 4.1 | kJ/mol | IMob | Robson and Kumar, 1973 | gas phase; M |
By formula: K+ + He = (K+ • He)
Quantity | Value | Units | Method | Reference | Comment |
---|---|---|---|---|---|
ΔrH° | 2.4 | kJ/mol | SCATTERING | Gislason, 1984 | gas phase; M |
ΔrH° | 2.2 | kJ/mol | IMob | Viehland, 1984 | gas phase; M |
ΔrH° | 2.2 | kJ/mol | IMob | Takebe, 1983 | gas phase; M |
ΔrH° | 2.4 | kJ/mol | IMob | Robson and Kumar, 1973 | gas phase; M |
By formula: K+ + Xe = (K+ • Xe)
Quantity | Value | Units | Method | Reference | Comment |
---|---|---|---|---|---|
ΔrH° | 18.0 | kJ/mol | IMob | Gatland, 1984 | gas phase; M |
ΔrH° | 15.8 | kJ/mol | SCATTERING | Gislason, 1984 | gas phase; M |
ΔrH° | 20.3 | kJ/mol | IMob | Viehland, 1984 | gas phase; M |
ΔrH° | 22.3 | kJ/mol | IMob | Takebe, 1983 | gas phase; M |
By formula: K+ + BrK = (K+ • BrK)
Quantity | Value | Units | Method | Reference | Comment |
---|---|---|---|---|---|
ΔrH° | 174. | kJ/mol | MS | Kudin, Gusarov, et al., 1973 | gas phase; Knudsen cell; M |
ΔrH° | 171. | kJ/mol | MS | Chupka, 1959 | gas phase; Knudsen cell; M |
Quantity | Value | Units | Method | Reference | Comment |
ΔrS° | 95.4 | J/mol*K | MS | Chupka, 1959 | gas phase; Knudsen cell; M |
By formula: K+ + CO2 = (K+ • CO2)
Quantity | Value | Units | Method | Reference | Comment |
---|---|---|---|---|---|
ΔrH° | 36. | kJ/mol | HPMS | Castleman and Keesee, 1981 | gas phase; M |
Quantity | Value | Units | Method | Reference | Comment |
ΔrS° | 63.6 | J/mol*K | HPMS | Castleman and Keesee, 1981 | gas phase; M |
Free energy of reaction
ΔrG° (kJ/mol) | T (K) | Method | Reference | Comment |
---|---|---|---|---|
15. | 310. | DT | Keller and Beyer, 1971 | gas phase; low E/N; M |
By formula: (K+ • H2) + H2 = (K+ • 2H2)
Quantity | Value | Units | Method | Reference | Comment |
---|---|---|---|---|---|
ΔrH° | 6.15 | kJ/mol | SIDT | Bushnell, Kemper, et al., 1994 | gas phase; ΔrH(0K) = 5.65 kJ/mol; M |
Quantity | Value | Units | Method | Reference | Comment |
ΔrS° | 46.9 | J/mol*K | SIDT | Bushnell, Kemper, et al., 1994 | gas phase; ΔrH(0K) = 5.65 kJ/mol; M |
By formula: (K+ • 2C2H8N2) + C2H8N2 = (K+ • 3C2H8N2)
Bond type: Polydentate bonding in non-hydrogen-bonded positive ions
Quantity | Value | Units | Method | Reference | Comment |
---|---|---|---|---|---|
ΔrH° | 54.0 | kJ/mol | HPMS | Davidson and Kebarle, 1976, 3 | gas phase; M |
Quantity | Value | Units | Method | Reference | Comment |
ΔrS° | 110. | J/mol*K | HPMS | Davidson and Kebarle, 1976, 3 | gas phase; M |
By formula: (K+ • 2H2O) + CH4O = (K+ • CH4O • 2H2O)
Quantity | Value | Units | Method | Reference | Comment |
---|---|---|---|---|---|
ΔrH° | 69.5 | kJ/mol | HPMS | Evans and Keesee, 1991 | gas phase; switching reaction,n(K+)3H2O; M |
Quantity | Value | Units | Method | Reference | Comment |
ΔrS° | 129. | J/mol*K | HPMS | Evans and Keesee, 1991 | gas phase; switching reaction,n(K+)3H2O; M |
By formula: (K+ • C2H8N2) + C2H8N2 = (K+ • 2C2H8N2)
Bond type: Polydentate bonding in non-hydrogen-bonded positive ions
Quantity | Value | Units | Method | Reference | Comment |
---|---|---|---|---|---|
ΔrH° | 92.9 | kJ/mol | HPMS | Davidson and Kebarle, 1976, 3 | gas phase; M |
Quantity | Value | Units | Method | Reference | Comment |
ΔrS° | 134. | J/mol*K | HPMS | Davidson and Kebarle, 1976, 3 | gas phase; M |
By formula: (K+ • 2C3H6O) + C3H6O = (K+ • 3C3H6O)
Quantity | Value | Units | Method | Reference | Comment |
---|---|---|---|---|---|
ΔrH° | 67. | kJ/mol | HPMS | Sunner, 1984 | gas phase; M |
Quantity | Value | Units | Method | Reference | Comment |
ΔrS° | 100. | J/mol*K | HPMS | Sunner, 1984 | gas phase; M |
Free energy of reaction
ΔrG° (kJ/mol) | T (K) | Method | Reference | Comment |
---|---|---|---|---|
38. | 293. | ES/HPMS | Blades, Klassen, et al., 1995 | gas phase; M |
By formula: K+ + H2 = (K+ • H2)
Quantity | Value | Units | Method | Reference | Comment |
---|---|---|---|---|---|
ΔrH° | 7.78 | kJ/mol | SIDT | Bushnell, Kemper, et al., 1994 | gas phase; ΔrH(0K) = 6.07 kJ/mol; M |
Quantity | Value | Units | Method | Reference | Comment |
ΔrS° | 56.5 | J/mol*K | SIDT | Bushnell, Kemper, et al., 1994 | gas phase; ΔrH(0K) = 6.07 kJ/mol; M |
By formula: K+ + C2H8N2 = (K+ • C2H8N2)
Bond type: Polydentate bonding in non-hydrogen-bonded positive ions
Quantity | Value | Units | Method | Reference | Comment |
---|---|---|---|---|---|
ΔrH° | 108. | kJ/mol | HPMS | Davidson and Kebarle, 1976, 3 | gas phase; M |
Quantity | Value | Units | Method | Reference | Comment |
ΔrS° | 93.3 | J/mol*K | HPMS | Davidson and Kebarle, 1976, 3 | gas phase; M |
By formula: (K+ • 4C2H6OS) + C2H6OS = (K+ • 5C2H6OS)
Quantity | Value | Units | Method | Reference | Comment |
---|---|---|---|---|---|
ΔrH° | 66.1 | kJ/mol | HPMS | Sunner, 1984 | gas phase; Entropy change is questionable; M |
Quantity | Value | Units | Method | Reference | Comment |
ΔrS° | 150. | J/mol*K | HPMS | Sunner, 1984 | gas phase; Entropy change is questionable; M |
By formula: (K+ • 5C2H6OS) + C2H6OS = (K+ • 6C2H6OS)
Quantity | Value | Units | Method | Reference | Comment |
---|---|---|---|---|---|
ΔrH° | 64.9 | kJ/mol | HPMS | Sunner, 1984 | gas phase; Entropy change is questionable; M |
Quantity | Value | Units | Method | Reference | Comment |
ΔrS° | 170. | J/mol*K | HPMS | Sunner, 1984 | gas phase; Entropy change is questionable; M |
By formula: (K+ • C6H6) + C6H6 = (K+ • 2C6H6)
Quantity | Value | Units | Method | Reference | Comment |
---|---|---|---|---|---|
ΔrH° | 67.4 ± 7.1 | kJ/mol | CIDT | Amicangelo and Armentrout, 2000 | RCD |
ΔrH° | 78.7 | kJ/mol | HPMS | Sunner, Nishizawa, et al., 1981 | gas phase; M |
Quantity | Value | Units | Method | Reference | Comment |
ΔrS° | 142. | J/mol*K | HPMS | Sunner, Nishizawa, et al., 1981 | gas phase; M |
By formula: K+ + CH4O = (K+ • CH4O)
Quantity | Value | Units | Method | Reference | Comment |
---|---|---|---|---|---|
ΔrH° | 91.6 | kJ/mol | HPMS | Evans and Keesee, 1991 | gas phase; switching reaction,n(K+)H2O; M |
Quantity | Value | Units | Method | Reference | Comment |
ΔrS° | 132. | J/mol*K | HPMS | Evans and Keesee, 1991 | gas phase; switching reaction,n(K+)H2O; M |
By formula: K+ + C5H5N = (K+ • C5H5N)
Quantity | Value | Units | Method | Reference | Comment |
---|---|---|---|---|---|
ΔrH° | 90. ± 4. | kJ/mol | CIDT | Amunugama and Rodgers, 2000 | RCD |
ΔrH° | 86.6 | kJ/mol | HPMS | Davidson and Kebarle, 1976, 2 | gas phase; M |
Quantity | Value | Units | Method | Reference | Comment |
ΔrS° | 77.8 | J/mol*K | HPMS | Davidson and Kebarle, 1976, 2 | gas phase; M |
By formula: K+ + C6H6 = (K+ • C6H6)
Quantity | Value | Units | Method | Reference | Comment |
---|---|---|---|---|---|
ΔrH° | 73. ± 4. | kJ/mol | CIDT | Amicangelo and Armentrout, 2000 | RCD |
ΔrH° | 80.3 | kJ/mol | HPMS | Sunner, Nishizawa, et al., 1981 | gas phase; M |
Quantity | Value | Units | Method | Reference | Comment |
ΔrS° | 103. | J/mol*K | HPMS | Sunner, Nishizawa, et al., 1981 | gas phase; M |
By formula: K+ + C4H9NO = (K+ • C4H9NO)
Quantity | Value | Units | Method | Reference | Comment |
---|---|---|---|---|---|
ΔrH° | 121. | kJ/mol | CIDT | Klassen, Anderson, et al., 1996 | RCD |
ΔrH° | 130. | kJ/mol | HPMS | Sunner, 1984 | gas phase; M |
Quantity | Value | Units | Method | Reference | Comment |
ΔrS° | 96. | J/mol*K | HPMS | Sunner, 1984 | gas phase; M |
By formula: K+ + C3H6O = (K+ • C3H6O)
Quantity | Value | Units | Method | Reference | Comment |
---|---|---|---|---|---|
ΔrH° | 102. | kJ/mol | CIDT | Klassen, Anderson, et al., 1996 | RCD |
ΔrH° | 110. | kJ/mol | HPMS | Sunner, 1984 | gas phase; M |
Quantity | Value | Units | Method | Reference | Comment |
ΔrS° | 100. | J/mol*K | HPMS | Sunner, 1984 | gas phase; M |
By formula: K+ + C2H6OS = (K+ • C2H6OS)
Quantity | Value | Units | Method | Reference | Comment |
---|---|---|---|---|---|
ΔrH° | 130. | kJ/mol | CIDT | Klassen, Anderson, et al., 1996 | RCD |
ΔrH° | 150. | kJ/mol | HPMS | Sunner, 1984 | gas phase; M |
Quantity | Value | Units | Method | Reference | Comment |
ΔrS° | 130. | J/mol*K | HPMS | Sunner, 1984 | gas phase; M |
By formula: K+ + C3H7NO = (K+ • C3H7NO)
Quantity | Value | Units | Method | Reference | Comment |
---|---|---|---|---|---|
ΔrH° | 123. | kJ/mol | CIDT | Klassen, Anderson, et al., 1996 | RCD |
ΔrH° | 130. | kJ/mol | HPMS | Sunner, 1984 | gas phase; M |
Quantity | Value | Units | Method | Reference | Comment |
ΔrS° | 110. | J/mol*K | HPMS | Sunner, 1984 | gas phase; M |
By formula: (K+ • H2O • CH4O) + H2O = (K+ • 2H2O • CH4O)
Quantity | Value | Units | Method | Reference | Comment |
---|---|---|---|---|---|
ΔrH° | 54.8 | kJ/mol | HPMS | Evans and Keesee, 1991 | gas phase; M |
Quantity | Value | Units | Method | Reference | Comment |
ΔrS° | 94.6 | J/mol*K | HPMS | Evans and Keesee, 1991 | gas phase; M |
By formula: (K+ • 2CH4O • H2O) + CH4O = (K+ • 3CH4O • H2O)
Quantity | Value | Units | Method | Reference | Comment |
---|---|---|---|---|---|
ΔrH° | 52.3 | kJ/mol | HPMS | Evans and Keesee, 1991 | gas phase; M |
Quantity | Value | Units | Method | Reference | Comment |
ΔrS° | 107. | J/mol*K | HPMS | Evans and Keesee, 1991 | gas phase; M |
By formula: (K+ • CH4O • H2O) + CH4O = (K+ • 2CH4O • H2O)
Quantity | Value | Units | Method | Reference | Comment |
---|---|---|---|---|---|
ΔrH° | 56.5 | kJ/mol | HPMS | Evans and Keesee, 1991 | gas phase; M |
Quantity | Value | Units | Method | Reference | Comment |
ΔrS° | 114. | J/mol*K | HPMS | Evans and Keesee, 1991 | gas phase; M |
By formula: (K+ • 2CH4O) + H2O = (K+ • H2O • 2CH4O)
Quantity | Value | Units | Method | Reference | Comment |
---|---|---|---|---|---|
ΔrH° | 47.3 | kJ/mol | HPMS | Evans and Keesee, 1991 | gas phase; M |
Quantity | Value | Units | Method | Reference | Comment |
ΔrS° | 75.3 | J/mol*K | HPMS | Evans and Keesee, 1991 | gas phase; M |
By formula: K+ + ClK = (K+ • ClK)
Quantity | Value | Units | Method | Reference | Comment |
---|---|---|---|---|---|
ΔrH° | 172. | kJ/mol | MS | Chupka, 1959 | gas phase; Knudsen cell; M |
Quantity | Value | Units | Method | Reference | Comment |
ΔrS° | 82.0 | J/mol*K | MS | Chupka, 1959 | gas phase; Knudsen cell; M |
By formula: (K+ • CH4O) + H2O = (K+ • H2O • CH4O)
Quantity | Value | Units | Method | Reference | Comment |
---|---|---|---|---|---|
ΔrH° | 65.3 | kJ/mol | HPMS | Evans and Keesee, 1991 | gas phase; M |
Quantity | Value | Units | Method | Reference | Comment |
ΔrS° | 94.1 | J/mol*K | HPMS | Evans and Keesee, 1991 | gas phase; M |
By formula: (K+ • H2O) + CH4O = (K+ • CH4O • H2O)
Quantity | Value | Units | Method | Reference | Comment |
---|---|---|---|---|---|
ΔrH° | 82.0 | kJ/mol | HPMS | Evans and Keesee, 1991 | gas phase; M |
Quantity | Value | Units | Method | Reference | Comment |
ΔrS° | 136. | J/mol*K | HPMS | Evans and Keesee, 1991 | gas phase; M |

Ion clustering data

Data compiled as indicated in comments:
RCD - Robert C. Dunbar
M - Michael M. Meot-Ner (Mautner) and Sharon G. Lias
Clustering reactions
By formula: K+ + Ar = (K+ • Ar)
Quantity | Value | Units | Method | Reference | Comment |
---|---|---|---|---|---|
ΔrH° | 12. ± 3. | kJ/mol | AVG | N/A | Average of 9 values; Individual data points |
By formula: K+ + BrK = (K+ • BrK)
Quantity | Value | Units | Method | Reference | Comment |
---|---|---|---|---|---|
ΔrH° | 174. | kJ/mol | MS | Kudin, Gusarov, et al., 1973 | gas phase; Knudsen cell; M |
ΔrH° | 171. | kJ/mol | MS | Chupka, 1959 | gas phase; Knudsen cell; M |
Quantity | Value | Units | Method | Reference | Comment |
ΔrS° | 95.4 | J/mol*K | MS | Chupka, 1959 | gas phase; Knudsen cell; M |
By formula: K+ + CH2N4 = (K+ • CH2N4)
Quantity | Value | Units | Method | Reference | Comment |
---|---|---|---|---|---|
ΔrH° | 89.1 ± 5.0 | kJ/mol | CIDT | Rodgers and Armentrout, 2000 | RCD |
By formula: K+ + CH4O = (K+ • CH4O)
Quantity | Value | Units | Method | Reference | Comment |
---|---|---|---|---|---|
ΔrH° | 91.6 | kJ/mol | HPMS | Evans and Keesee, 1991 | gas phase; switching reaction,n(K+)H2O; M |
Quantity | Value | Units | Method | Reference | Comment |
ΔrS° | 132. | J/mol*K | HPMS | Evans and Keesee, 1991 | gas phase; switching reaction,n(K+)H2O; M |
By formula: (K+ • CH4O) + CH4O = (K+ • 2CH4O)
Quantity | Value | Units | Method | Reference | Comment |
---|---|---|---|---|---|
ΔrH° | 75.3 | kJ/mol | HPMS | Evans and Keesee, 1991 | gas phase; M |
Quantity | Value | Units | Method | Reference | Comment |
ΔrS° | 150. | J/mol*K | HPMS | Evans and Keesee, 1991 | gas phase; M |
By formula: (K+ • 2CH4O) + CH4O = (K+ • 3CH4O)
Quantity | Value | Units | Method | Reference | Comment |
---|---|---|---|---|---|
ΔrH° | 60.7 | kJ/mol | HPMS | Evans and Keesee, 1991 | gas phase; M |
Quantity | Value | Units | Method | Reference | Comment |
ΔrS° | 120. | J/mol*K | HPMS | Evans and Keesee, 1991 | gas phase; M |
By formula: (K+ • 3CH4O) + CH4O = (K+ • 4CH4O)
Quantity | Value | Units | Method | Reference | Comment |
---|---|---|---|---|---|
ΔrH° | 52.3 | kJ/mol | HPMS | Evans and Keesee, 1991 | gas phase; M |
Quantity | Value | Units | Method | Reference | Comment |
ΔrS° | 120. | J/mol*K | HPMS | Evans and Keesee, 1991 | gas phase; M |
By formula: (K+ • CH4O) + H2O = (K+ • H2O • CH4O)
Quantity | Value | Units | Method | Reference | Comment |
---|---|---|---|---|---|
ΔrH° | 65.3 | kJ/mol | HPMS | Evans and Keesee, 1991 | gas phase; M |
Quantity | Value | Units | Method | Reference | Comment |
ΔrS° | 94.1 | J/mol*K | HPMS | Evans and Keesee, 1991 | gas phase; M |
By formula: (K+ • 2CH4O) + H2O = (K+ • H2O • 2CH4O)
Quantity | Value | Units | Method | Reference | Comment |
---|---|---|---|---|---|
ΔrH° | 47.3 | kJ/mol | HPMS | Evans and Keesee, 1991 | gas phase; M |
Quantity | Value | Units | Method | Reference | Comment |
ΔrS° | 75.3 | J/mol*K | HPMS | Evans and Keesee, 1991 | gas phase; M |
By formula: (K+ • CH4O • H2O) + CH4O = (K+ • 2CH4O • H2O)
Quantity | Value | Units | Method | Reference | Comment |
---|---|---|---|---|---|
ΔrH° | 56.5 | kJ/mol | HPMS | Evans and Keesee, 1991 | gas phase; M |
Quantity | Value | Units | Method | Reference | Comment |
ΔrS° | 114. | J/mol*K | HPMS | Evans and Keesee, 1991 | gas phase; M |
By formula: (K+ • 2CH4O • H2O) + CH4O = (K+ • 3CH4O • H2O)
Quantity | Value | Units | Method | Reference | Comment |
---|---|---|---|---|---|
ΔrH° | 52.3 | kJ/mol | HPMS | Evans and Keesee, 1991 | gas phase; M |
Quantity | Value | Units | Method | Reference | Comment |
ΔrS° | 107. | J/mol*K | HPMS | Evans and Keesee, 1991 | gas phase; M |
By formula: K+ + CH5N = (K+ • CH5N)
Quantity | Value | Units | Method | Reference | Comment |
---|---|---|---|---|---|
ΔrH° | 79.9 | kJ/mol | HPMS | Davidson and Kebarle, 1976, 2 | gas phase; switching reaction(K+)H2O; Davidson and Kebarle, 1976; M |
Quantity | Value | Units | Method | Reference | Comment |
ΔrS° | 91.2 | J/mol*K | HPMS | Davidson and Kebarle, 1976, 2 | gas phase; switching reaction(K+)H2O; Davidson and Kebarle, 1976; M |
Quantity | Value | Units | Method | Reference | Comment |
ΔrG° | 53.1 | kJ/mol | HPMS | Davidson and Kebarle, 1976, 2 | gas phase; switching reaction(K+)H2O; Davidson and Kebarle, 1976; M |
By formula: K+ + CO = (K+ • CO)
Quantity | Value | Units | Method | Reference | Comment |
---|---|---|---|---|---|
ΔrH° | 18. ± 5.0 | kJ/mol | CIDT | Rodgers and Armentrout, 2000 | RCD |
By formula: K+ + CO2 = (K+ • CO2)
Quantity | Value | Units | Method | Reference | Comment |
---|---|---|---|---|---|
ΔrH° | 36. | kJ/mol | HPMS | Castleman and Keesee, 1981 | gas phase; M |
Quantity | Value | Units | Method | Reference | Comment |
ΔrS° | 63.6 | J/mol*K | HPMS | Castleman and Keesee, 1981 | gas phase; M |
Free energy of reaction
ΔrG° (kJ/mol) | T (K) | Method | Reference | Comment |
---|---|---|---|---|
15. | 310. | DT | Keller and Beyer, 1971 | gas phase; low E/N; M |
By formula: K+ + C2H3N = (K+ • C2H3N)
Quantity | Value | Units | Method | Reference | Comment |
---|---|---|---|---|---|
ΔrH° | 102. | kJ/mol | HPMS | Davidson and Kebarle, 1976 | gas phase; M |
Quantity | Value | Units | Method | Reference | Comment |
ΔrS° | 90.0 | J/mol*K | HPMS | Davidson and Kebarle, 1976 | gas phase; M |
By formula: (K+ • C2H3N) + C2H3N = (K+ • 2C2H3N)
Quantity | Value | Units | Method | Reference | Comment |
---|---|---|---|---|---|
ΔrH° | 86.2 | kJ/mol | HPMS | Davidson and Kebarle, 1976 | gas phase; M |
Quantity | Value | Units | Method | Reference | Comment |
ΔrS° | 101. | J/mol*K | HPMS | Davidson and Kebarle, 1976 | gas phase; M |
By formula: (K+ • 2C2H3N) + C2H3N = (K+ • 3C2H3N)
Quantity | Value | Units | Method | Reference | Comment |
---|---|---|---|---|---|
ΔrH° | 76.1 | kJ/mol | HPMS | Davidson and Kebarle, 1976 | gas phase; M |
Quantity | Value | Units | Method | Reference | Comment |
ΔrS° | 118. | J/mol*K | HPMS | Davidson and Kebarle, 1976 | gas phase; M |
By formula: (K+ • 3C2H3N) + C2H3N = (K+ • 4C2H3N)
Quantity | Value | Units | Method | Reference | Comment |
---|---|---|---|---|---|
ΔrH° | 56.9 | kJ/mol | HPMS | Davidson and Kebarle, 1976 | gas phase; M |
Quantity | Value | Units | Method | Reference | Comment |
ΔrS° | 115. | J/mol*K | HPMS | Davidson and Kebarle, 1976 | gas phase; M |
By formula: (K+ • 4C2H3N) + C2H3N = (K+ • 5C2H3N)
Quantity | Value | Units | Method | Reference | Comment |
---|---|---|---|---|---|
ΔrH° | 48.1 | kJ/mol | HPMS | Davidson and Kebarle, 1976 | gas phase; M |
Quantity | Value | Units | Method | Reference | Comment |
ΔrS° | 141. | J/mol*K | HPMS | Davidson and Kebarle, 1976 | gas phase; M |
By formula: K+ + C2H3N3 = (K+ • C2H3N3)
Quantity | Value | Units | Method | Reference | Comment |
---|---|---|---|---|---|
ΔrH° | 54.8 ± 5.9 | kJ/mol | CIDT | Rodgers and Armentrout, 2000 | RCD |
By formula: K+ + C2H3N3 = (K+ • C2H3N3)
Quantity | Value | Units | Method | Reference | Comment |
---|---|---|---|---|---|
ΔrH° | 87.0 ± 5.0 | kJ/mol | CIDT | Rodgers and Armentrout, 2000 | RCD |
By formula: K+ + C2H5NO = (K+ • C2H5NO)
Quantity | Value | Units | Method | Reference | Comment |
---|---|---|---|---|---|
ΔrH° | 124. | kJ/mol | CIDT | Klassen, Anderson, et al., 1996 | RCD |
By formula: K+ + C2H5NO2 = (K+ • C2H5NO2)
Quantity | Value | Units | Method | Reference | Comment |
---|---|---|---|---|---|
ΔrH° | 126. | kJ/mol | CIDT | Klassen, Anderson, et al., 1996 | RCD |
By formula: K+ + C2H6OS = (K+ • C2H6OS)
Quantity | Value | Units | Method | Reference | Comment |
---|---|---|---|---|---|
ΔrH° | 130. | kJ/mol | CIDT | Klassen, Anderson, et al., 1996 | RCD |
ΔrH° | 150. | kJ/mol | HPMS | Sunner, 1984 | gas phase; M |
Quantity | Value | Units | Method | Reference | Comment |
ΔrS° | 130. | J/mol*K | HPMS | Sunner, 1984 | gas phase; M |
By formula: (K+ • C2H6OS) + C2H6OS = (K+ • 2C2H6OS)
Quantity | Value | Units | Method | Reference | Comment |
---|---|---|---|---|---|
ΔrH° | 120. | kJ/mol | HPMS | Sunner, 1984 | gas phase; M |
Quantity | Value | Units | Method | Reference | Comment |
ΔrS° | 140. | J/mol*K | HPMS | Sunner, 1984 | gas phase; M |
By formula: (K+ • 2C2H6OS) + C2H6OS = (K+ • 3C2H6OS)
Quantity | Value | Units | Method | Reference | Comment |
---|---|---|---|---|---|
ΔrH° | 84. | kJ/mol | HPMS | Sunner, 1984 | gas phase; M |
Quantity | Value | Units | Method | Reference | Comment |
ΔrS° | 120. | J/mol*K | HPMS | Sunner, 1984 | gas phase; M |
By formula: (K+ • 3C2H6OS) + C2H6OS = (K+ • 4C2H6OS)
Quantity | Value | Units | Method | Reference | Comment |
---|---|---|---|---|---|
ΔrH° | 67. | kJ/mol | HPMS | Sunner, 1984 | gas phase; M |
Quantity | Value | Units | Method | Reference | Comment |
ΔrS° | 130. | J/mol*K | HPMS | Sunner, 1984 | gas phase; M |
By formula: (K+ • 4C2H6OS) + C2H6OS = (K+ • 5C2H6OS)
Quantity | Value | Units | Method | Reference | Comment |
---|---|---|---|---|---|
ΔrH° | 66.1 | kJ/mol | HPMS | Sunner, 1984 | gas phase; Entropy change is questionable; M |
Quantity | Value | Units | Method | Reference | Comment |
ΔrS° | 150. | J/mol*K | HPMS | Sunner, 1984 | gas phase; Entropy change is questionable; M |
By formula: (K+ • 5C2H6OS) + C2H6OS = (K+ • 6C2H6OS)
Quantity | Value | Units | Method | Reference | Comment |
---|---|---|---|---|---|
ΔrH° | 64.9 | kJ/mol | HPMS | Sunner, 1984 | gas phase; Entropy change is questionable; M |
Quantity | Value | Units | Method | Reference | Comment |
ΔrS° | 170. | J/mol*K | HPMS | Sunner, 1984 | gas phase; Entropy change is questionable; M |
By formula: K+ + C2H6O = (K+ • C2H6O)
Quantity | Value | Units | Method | Reference | Comment |
---|---|---|---|---|---|
ΔrH° | 72.8 ± 4.2 | kJ/mol | CIDT | Rodgers and Armentrout, 2000 | RCD |
ΔrH° | 92.9 | kJ/mol | HPMS | Davidson and Kebarle, 1976, 3 | gas phase; M |
ΔrH° | 87.0 | kJ/mol | HPMS | Davidson and Kebarle, 1976, 2 | gas phase; M |
Quantity | Value | Units | Method | Reference | Comment |
ΔrS° | 112. | J/mol*K | HPMS | Davidson and Kebarle, 1976, 3 | gas phase; M |
ΔrS° | 104. | J/mol*K | HPMS | Davidson and Kebarle, 1976, 2 | gas phase; M |
By formula: (K+ • C2H6O) + C2H6O = (K+ • 2C2H6O)
Quantity | Value | Units | Method | Reference | Comment |
---|---|---|---|---|---|
ΔrH° | 69.0 ± 5.0 | kJ/mol | CIDT | Rodgers and Armentrout, 2000 | RCD |
By formula: (K+ • 2C2H6O) + C2H6O = (K+ • 3C2H6O)
Quantity | Value | Units | Method | Reference | Comment |
---|---|---|---|---|---|
ΔrH° | 56.9 ± 4.2 | kJ/mol | CIDT | Rodgers and Armentrout, 2000 | RCD |
By formula: (K+ • 3C2H6O) + C2H6O = (K+ • 4C2H6O)
Quantity | Value | Units | Method | Reference | Comment |
---|---|---|---|---|---|
ΔrH° | 50.2 ± 7.9 | kJ/mol | CIDT | Rodgers and Armentrout, 2000 | RCD |
By formula: K+ + C2H7N = (K+ • C2H7N)
Quantity | Value | Units | Method | Reference | Comment |
---|---|---|---|---|---|
ΔrH° | 81.6 | kJ/mol | HPMS | Davidson and Kebarle, 1976, 2 | gas phase; M |
Quantity | Value | Units | Method | Reference | Comment |
ΔrS° | 89.5 | J/mol*K | HPMS | Davidson and Kebarle, 1976, 2 | gas phase; M |
By formula: K+ + C2H8N2 = (K+ • C2H8N2)
Bond type: Polydentate bonding in non-hydrogen-bonded positive ions
Quantity | Value | Units | Method | Reference | Comment |
---|---|---|---|---|---|
ΔrH° | 108. | kJ/mol | HPMS | Davidson and Kebarle, 1976, 3 | gas phase; M |
Quantity | Value | Units | Method | Reference | Comment |
ΔrS° | 93.3 | J/mol*K | HPMS | Davidson and Kebarle, 1976, 3 | gas phase; M |
By formula: (K+ • C2H8N2) + C2H8N2 = (K+ • 2C2H8N2)
Bond type: Polydentate bonding in non-hydrogen-bonded positive ions
Quantity | Value | Units | Method | Reference | Comment |
---|---|---|---|---|---|
ΔrH° | 92.9 | kJ/mol | HPMS | Davidson and Kebarle, 1976, 3 | gas phase; M |
Quantity | Value | Units | Method | Reference | Comment |
ΔrS° | 134. | J/mol*K | HPMS | Davidson and Kebarle, 1976, 3 | gas phase; M |
By formula: (K+ • 2C2H8N2) + C2H8N2 = (K+ • 3C2H8N2)
Bond type: Polydentate bonding in non-hydrogen-bonded positive ions
Quantity | Value | Units | Method | Reference | Comment |
---|---|---|---|---|---|
ΔrH° | 54.0 | kJ/mol | HPMS | Davidson and Kebarle, 1976, 3 | gas phase; M |
Quantity | Value | Units | Method | Reference | Comment |
ΔrS° | 110. | J/mol*K | HPMS | Davidson and Kebarle, 1976, 3 | gas phase; M |
By formula: K+ + C3H3N3 = (K+ • C3H3N3)
Quantity | Value | Units | Method | Reference | Comment |
---|---|---|---|---|---|
ΔrH° | 55. ± 3. | kJ/mol | CIDT | Amunugama and Rodgers, 2000 | RCD |
By formula: K+ + C3H4N2 = (K+ • C3H4N2)
Quantity | Value | Units | Method | Reference | Comment |
---|---|---|---|---|---|
ΔrH° | 84. ± 3. | kJ/mol | CIDT | Huang and Rodgers, 2002 | RCD |
By formula: K+ + C3H4N2 = (K+ • C3H4N2)
Quantity | Value | Units | Method | Reference | Comment |
---|---|---|---|---|---|
ΔrH° | 109. ± 5.4 | kJ/mol | CIDT | Huang and Rodgers, 2002 | RCD |
By formula: K+ + C3H6O = (K+ • C3H6O)
Quantity | Value | Units | Method | Reference | Comment |
---|---|---|---|---|---|
ΔrH° | 102. | kJ/mol | CIDT | Klassen, Anderson, et al., 1996 | RCD |
ΔrH° | 110. | kJ/mol | HPMS | Sunner, 1984 | gas phase; M |
Quantity | Value | Units | Method | Reference | Comment |
ΔrS° | 100. | J/mol*K | HPMS | Sunner, 1984 | gas phase; M |
By formula: (K+ • C3H6O) + C3H6O = (K+ • 2C3H6O)
Quantity | Value | Units | Method | Reference | Comment |
---|---|---|---|---|---|
ΔrH° | 88. | kJ/mol | HPMS | Sunner, 1984 | gas phase; M |
Quantity | Value | Units | Method | Reference | Comment |
ΔrS° | 110. | J/mol*K | HPMS | Sunner, 1984 | gas phase; M |
By formula: (K+ • 2C3H6O) + C3H6O = (K+ • 3C3H6O)
Quantity | Value | Units | Method | Reference | Comment |
---|---|---|---|---|---|
ΔrH° | 67. | kJ/mol | HPMS | Sunner, 1984 | gas phase; M |
Quantity | Value | Units | Method | Reference | Comment |
ΔrS° | 100. | J/mol*K | HPMS | Sunner, 1984 | gas phase; M |
Free energy of reaction
ΔrG° (kJ/mol) | T (K) | Method | Reference | Comment |
---|---|---|---|---|
38. | 293. | ES/HPMS | Blades, Klassen, et al., 1995 | gas phase; M |
By formula: (K+ • 3C3H6O) + C3H6O = (K+ • 4C3H6O)
Free energy of reaction
ΔrG° (kJ/mol) | T (K) | Method | Reference | Comment |
---|---|---|---|---|
25. | 293. | ES/HPMS | Blades, Klassen, et al., 1995 | gas phase; M |
By formula: K+ + C3H7NO = (K+ • C3H7NO)
Quantity | Value | Units | Method | Reference | Comment |
---|---|---|---|---|---|
ΔrH° | 123. | kJ/mol | CIDT | Klassen, Anderson, et al., 1996 | RCD |
ΔrH° | 130. | kJ/mol | HPMS | Sunner, 1984 | gas phase; M |
Quantity | Value | Units | Method | Reference | Comment |
ΔrS° | 110. | J/mol*K | HPMS | Sunner, 1984 | gas phase; M |
By formula: (K+ • C3H7NO) + C3H7NO = (K+ • 2C3H7NO)
Quantity | Value | Units | Method | Reference | Comment |
---|---|---|---|---|---|
ΔrH° | 88. | kJ/mol | HPMS | Sunner, 1984 | gas phase; M |
Quantity | Value | Units | Method | Reference | Comment |
ΔrS° | 84. | J/mol*K | HPMS | Sunner, 1984 | gas phase; M |
By formula: (K+ • 2C3H7NO) + C3H7NO = (K+ • 3C3H7NO)
Quantity | Value | Units | Method | Reference | Comment |
---|---|---|---|---|---|
ΔrH° | 63. | kJ/mol | HPMS | Sunner, 1984 | gas phase; M |
Quantity | Value | Units | Method | Reference | Comment |
ΔrS° | 75. | J/mol*K | HPMS | Sunner, 1984 | gas phase; M |
By formula: (K+ • 3C3H7NO) + C3H7NO = (K+ • 4C3H7NO)
Quantity | Value | Units | Method | Reference | Comment |
---|---|---|---|---|---|
ΔrH° | 54. | kJ/mol | HPMS | Sunner, 1984 | gas phase; M |
Quantity | Value | Units | Method | Reference | Comment |
ΔrS° | 100. | J/mol*K | HPMS | Sunner, 1984 | gas phase; M |
By formula: K+ + C3H7NO = (K+ • C3H7NO)
Quantity | Value | Units | Method | Reference | Comment |
---|---|---|---|---|---|
ΔrH° | 127. | kJ/mol | CIDT | Klassen, Anderson, et al., 1996 | RCD |
By formula: K+ + C3H9N = (K+ • C3H9N)
Quantity | Value | Units | Method | Reference | Comment |
---|---|---|---|---|---|
ΔrH° | 83.7 | kJ/mol | HPMS | Davidson and Kebarle, 1976, 2 | gas phase; switching reaction(K+)H2O; Davidson and Kebarle, 1976; M |
Quantity | Value | Units | Method | Reference | Comment |
ΔrS° | 97.9 | J/mol*K | HPMS | Davidson and Kebarle, 1976, 2 | gas phase; switching reaction(K+)H2O; Davidson and Kebarle, 1976; M |
Quantity | Value | Units | Method | Reference | Comment |
ΔrG° | 54.4 | kJ/mol | HPMS | Davidson and Kebarle, 1976, 2 | gas phase; switching reaction(K+)H2O; Davidson and Kebarle, 1976; M |
By formula: K+ + C3H9N = (K+ • C3H9N)
Quantity | Value | Units | Method | Reference | Comment |
---|---|---|---|---|---|
ΔrH° | 91.2 | kJ/mol | HPMS | Davidson and Kebarle, 1976, 2 | gas phase; M |
Quantity | Value | Units | Method | Reference | Comment |
ΔrS° | 107. | J/mol*K | HPMS | Davidson and Kebarle, 1976, 2 | gas phase; M |
By formula: K+ + C4H4N2O2 = (K+ • C4H4N2O2)
Quantity | Value | Units | Method | Reference | Comment |
---|---|---|---|---|---|
ΔrH° | 101. | kJ/mol | CIDC | Cerda and Wesdemiotis, 1996 | RCD |
By formula: K+ + C4H4N2 = (K+ • C4H4N2)
Quantity | Value | Units | Method | Reference | Comment |
---|---|---|---|---|---|
ΔrH° | 67. ± 4. | kJ/mol | CIDT | Amunugama and Rodgers, 2000 | RCD |
By formula: K+ + C4H5N = (K+ • C4H5N)
Quantity | Value | Units | Method | Reference | Comment |
---|---|---|---|---|---|
ΔrH° | 83.7 ± 4.2 | kJ/mol | CIDT | Huang and Rodgers, 2002 | RCD |
By formula: K+ + C4H5N3O = (K+ • C4H5N3O)
Quantity | Value | Units | Method | Reference | Comment |
---|---|---|---|---|---|
ΔrH° | 110. | kJ/mol | CIDC | Cerda and Wesdemiotis, 1996 | RCD |
By formula: K+ + C4H6N2 = (K+ • C4H6N2)
Quantity | Value | Units | Method | Reference | Comment |
---|---|---|---|---|---|
ΔrH° | 117. ± 3. | kJ/mol | CIDT | Huang and Rodgers, 2002 | RCD |
By formula: K+ + C4H6N2 = (K+ • C4H6N2)
Quantity | Value | Units | Method | Reference | Comment |
---|---|---|---|---|---|
ΔrH° | 94. ± 4. | kJ/mol | CIDT | Huang and Rodgers, 2002 | RCD |
By formula: K+ + C4H9NO = (K+ • C4H9NO)
Quantity | Value | Units | Method | Reference | Comment |
---|---|---|---|---|---|
ΔrH° | 121. | kJ/mol | CIDT | Klassen, Anderson, et al., 1996 | RCD |
ΔrH° | 130. | kJ/mol | HPMS | Sunner, 1984 | gas phase; M |
Quantity | Value | Units | Method | Reference | Comment |
ΔrS° | 96. | J/mol*K | HPMS | Sunner, 1984 | gas phase; M |
By formula: (K+ • C4H9NO) + C4H9NO = (K+ • 2C4H9NO)
Quantity | Value | Units | Method | Reference | Comment |
---|---|---|---|---|---|
ΔrH° | 100. | kJ/mol | HPMS | Sunner, 1984 | gas phase; M |
Quantity | Value | Units | Method | Reference | Comment |
ΔrS° | 100. | J/mol*K | HPMS | Sunner, 1984 | gas phase; M |
By formula: (K+ • 2C4H9NO) + C4H9NO = (K+ • 3C4H9NO)
Quantity | Value | Units | Method | Reference | Comment |
---|---|---|---|---|---|
ΔrH° | 75. | kJ/mol | HPMS | Sunner, 1984 | gas phase; M |
Quantity | Value | Units | Method | Reference | Comment |
ΔrS° | 100. | J/mol*K | HPMS | Sunner, 1984 | gas phase; M |
By formula: K+ + C4H10O = (K+ • C4H10O)
Quantity | Value | Units | Method | Reference | Comment |
---|---|---|---|---|---|
ΔrH° | 93.3 | kJ/mol | HPMS | Davidson and Kebarle, 1976, 2 | gas phase; M |
Quantity | Value | Units | Method | Reference | Comment |
ΔrS° | 103. | J/mol*K | HPMS | Davidson and Kebarle, 1976, 2 | gas phase; M |
By formula: K+ + C4H10O2 = (K+ • C4H10O2)
Bond type: Polydentate bonding in non-hydrogen-bonded positive ions
Quantity | Value | Units | Method | Reference | Comment |
---|---|---|---|---|---|
ΔrH° | 119. ± 4.2 | kJ/mol | CIDT | Rodgers and Armentrout, 2000 | RCD |
ΔrH° | 129. | kJ/mol | HPMS | Davidson and Kebarle, 1976, 3 | gas phase; M |
Quantity | Value | Units | Method | Reference | Comment |
ΔrS° | 112. | J/mol*K | HPMS | Davidson and Kebarle, 1976, 3 | gas phase; M |
By formula: (K+ • C4H10O2) + C4H10O2 = (K+ • 2C4H10O2)
Quantity | Value | Units | Method | Reference | Comment |
---|---|---|---|---|---|
ΔrH° | 89. ± 12. | kJ/mol | CIDT | Rodgers and Armentrout, 2000 | RCD |
By formula: K+ + C5H5N = (K+ • C5H5N)
Quantity | Value | Units | Method | Reference | Comment |
---|---|---|---|---|---|
ΔrH° | 90. ± 4. | kJ/mol | CIDT | Amunugama and Rodgers, 2000 | RCD |
ΔrH° | 86.6 | kJ/mol | HPMS | Davidson and Kebarle, 1976, 2 | gas phase; M |
Quantity | Value | Units | Method | Reference | Comment |
ΔrS° | 77.8 | J/mol*K | HPMS | Davidson and Kebarle, 1976, 2 | gas phase; M |
By formula: K+ + C5H5N5O = (K+ • C5H5N5O)
Quantity | Value | Units | Method | Reference | Comment |
---|---|---|---|---|---|
ΔrH° | 117. | kJ/mol | CIDC | Cerda and Wesdemiotis, 1996 | RCD |
By formula: K+ + C5H5N5 = (K+ • C5H5N5)
Quantity | Value | Units | Method | Reference | Comment |
---|---|---|---|---|---|
ΔrH° | 106. | kJ/mol | CIDC | Cerda and Wesdemiotis, 1996 | RCD |
By formula: K+ + C5H6N2O2 = (K+ • C5H6N2O2)
Quantity | Value | Units | Method | Reference | Comment |
---|---|---|---|---|---|
ΔrH° | 102. | kJ/mol | CIDC | Cerda and Wesdemiotis, 1996 | RCD |
By formula: K+ + C5H6N2 = (K+ • C5H6N2)
Quantity | Value | Units | Method | Reference | Comment |
---|---|---|---|---|---|
ΔrH° | 101. ± 3. | kJ/mol | CIDT | Rodgers, 2001 | RCD |
By formula: K+ + C5H6N2 = (K+ • C5H6N2)
Quantity | Value | Units | Method | Reference | Comment |
---|---|---|---|---|---|
ΔrH° | 109. ± 3. | kJ/mol | CIDT | Rodgers, 2001 | RCD |
By formula: K+ + C5H6N2 = (K+ • C5H6N2)
Quantity | Value | Units | Method | Reference | Comment |
---|---|---|---|---|---|
ΔrH° | 103. ± 4. | kJ/mol | CIDT | Rodgers, 2001 | RCD |
By formula: K+ + C5H7N = (K+ • C5H7N)
Quantity | Value | Units | Method | Reference | Comment |
---|---|---|---|---|---|
ΔrH° | 87.9 ± 6.3 | kJ/mol | CIDT | Huang and Rodgers, 2002 | RCD |
By formula: K+ + C6H5F = (K+ • C6H5F)
Quantity | Value | Units | Method | Reference | Comment |
---|---|---|---|---|---|
ΔrH° | 55. ± 3. | kJ/mol | CIDT | Amunugama and Rodgers, 2002 | RCD |
By formula: (K+ • C6H5F) + C6H5F = (K+ • 2C6H5F)
Quantity | Value | Units | Method | Reference | Comment |
---|---|---|---|---|---|
ΔrH° | 50. ± 3. | kJ/mol | CIDT | Amunugama and Rodgers, 2002 | RCD |
By formula: K+ + C6H6O = (K+ • C6H6O)
Quantity | Value | Units | Method | Reference | Comment |
---|---|---|---|---|---|
ΔrH° | 74. ± 3. | kJ/mol | CIDT | Amunugama and Rodgers, 2002, 2 | RCD |
By formula: (K+ • C6H6O) + C6H6O = (K+ • 2C6H6O)
Quantity | Value | Units | Method | Reference | Comment |
---|---|---|---|---|---|
ΔrH° | 68. ± 3. | kJ/mol | CIDT | Amunugama and Rodgers, 2002, 2 | RCD |
By formula: K+ + C6H6 = (K+ • C6H6)
Quantity | Value | Units | Method | Reference | Comment |
---|---|---|---|---|---|
ΔrH° | 73. ± 4. | kJ/mol | CIDT | Amicangelo and Armentrout, 2000 | RCD |
ΔrH° | 80.3 | kJ/mol | HPMS | Sunner, Nishizawa, et al., 1981 | gas phase; M |
Quantity | Value | Units | Method | Reference | Comment |
ΔrS° | 103. | J/mol*K | HPMS | Sunner, Nishizawa, et al., 1981 | gas phase; M |
By formula: (K+ • C6H6) + C6H6 = (K+ • 2C6H6)
Quantity | Value | Units | Method | Reference | Comment |
---|---|---|---|---|---|
ΔrH° | 67.4 ± 7.1 | kJ/mol | CIDT | Amicangelo and Armentrout, 2000 | RCD |
ΔrH° | 78.7 | kJ/mol | HPMS | Sunner, Nishizawa, et al., 1981 | gas phase; M |
Quantity | Value | Units | Method | Reference | Comment |
ΔrS° | 142. | J/mol*K | HPMS | Sunner, Nishizawa, et al., 1981 | gas phase; M |
By formula: (K+ • 2C6H6) + C6H6 = (K+ • 3C6H6)
Quantity | Value | Units | Method | Reference | Comment |
---|---|---|---|---|---|
ΔrH° | 60.7 | kJ/mol | HPMS | Sunner, Nishizawa, et al., 1981 | gas phase; M |
Quantity | Value | Units | Method | Reference | Comment |
ΔrS° | 137. | J/mol*K | HPMS | Sunner, Nishizawa, et al., 1981 | gas phase; M |
By formula: (K+ • 3C6H6) + C6H6 = (K+ • 4C6H6)
Quantity | Value | Units | Method | Reference | Comment |
---|---|---|---|---|---|
ΔrH° | 52.7 | kJ/mol | HPMS | Sunner, Nishizawa, et al., 1981 | gas phase; M |
Quantity | Value | Units | Method | Reference | Comment |
ΔrS° | 173. | J/mol*K | HPMS | Sunner, Nishizawa, et al., 1981 | gas phase; M |
By formula: (K+ • C6H6) + H2O = (K+ • H2O • C6H6)
Quantity | Value | Units | Method | Reference | Comment |
---|---|---|---|---|---|
ΔrH° | 75.7 | kJ/mol | HPMS | Sunner, Nishizawa, et al., 1981 | gas phase; switching reaction(K+ C6H6)C6H6; Searles and Kebarle, 1969; M |
Quantity | Value | Units | Method | Reference | Comment |
ΔrS° | 125. | J/mol*K | HPMS | Sunner, Nishizawa, et al., 1981 | gas phase; switching reaction(K+ C6H6)C6H6; Searles and Kebarle, 1969; M |
By formula: (K+ • 2C6H6) + H2O = (K+ • H2O • 2C6H6)
Quantity | Value | Units | Method | Reference | Comment |
---|---|---|---|---|---|
ΔrH° | 57.3 | kJ/mol | HPMS | Sunner, Nishizawa, et al., 1981 | gas phase; switching reaction(K+ 2H2O)C6H6; Searles and Kebarle, 1969; M |
Quantity | Value | Units | Method | Reference | Comment |
ΔrS° | 109. | J/mol*K | HPMS | Sunner, Nishizawa, et al., 1981 | gas phase; switching reaction(K+ 2H2O)C6H6; Searles and Kebarle, 1969; M |
By formula: (K+ • C6H6 • H2O) + C6H6 = (K+ • 2C6H6 • H2O)
Quantity | Value | Units | Method | Reference | Comment |
---|---|---|---|---|---|
ΔrH° | 60.2 | kJ/mol | HPMS | Sunner, Nishizawa, et al., 1981 | gas phase; From thermochemical cycle,switching reaction(K+ 3H2O)C6H6, Searles and Kebarle, 1969; M |
Quantity | Value | Units | Method | Reference | Comment |
ΔrS° | 126. | J/mol*K | HPMS | Sunner, Nishizawa, et al., 1981 | gas phase; From thermochemical cycle,switching reaction(K+ 3H2O)C6H6, Searles and Kebarle, 1969; M |
By formula: (K+ • C6H6 • 2H2O) + C6H6 = (K+ • 2C6H6 • 2H2O)
Quantity | Value | Units | Method | Reference | Comment |
---|---|---|---|---|---|
ΔrH° | 53.6 | kJ/mol | HPMS | Sunner, Nishizawa, et al., 1981 | gas phase; switching reaction(K+ 3H2O)C6H6; Searles and Kebarle, 1969; M |
Quantity | Value | Units | Method | Reference | Comment |
ΔrS° | 141. | J/mol*K | HPMS | Sunner, Nishizawa, et al., 1981 | gas phase; switching reaction(K+ 3H2O)C6H6; Searles and Kebarle, 1969; M |
By formula: K+ + C6H7N = (K+ • C6H7N)
Quantity | Value | Units | Method | Reference | Comment |
---|---|---|---|---|---|
ΔrH° | 95.4 | kJ/mol | HPMS | Davidson and Kebarle, 1976, 2 | gas phase; M |
Quantity | Value | Units | Method | Reference | Comment |
ΔrS° | 99.2 | J/mol*K | HPMS | Davidson and Kebarle, 1976, 2 | gas phase; M |
By formula: K+ + C6H7N = (K+ • C6H7N)
Quantity | Value | Units | Method | Reference | Comment |
---|---|---|---|---|---|
ΔrH° | 98.7 ± 4.2 | kJ/mol | CIDT | Rodgers, 2001, 2 | RCD |
By formula: K+ + C6H7N = (K+ • C6H7N)
Quantity | Value | Units | Method | Reference | Comment |
---|---|---|---|---|---|
ΔrH° | 100. ± 3. | kJ/mol | CIDT | Rodgers, 2001, 2 | RCD |
By formula: K+ + C6H7N = (K+ • C6H7N)
Quantity | Value | Units | Method | Reference | Comment |
---|---|---|---|---|---|
ΔrH° | 98. ± 3. | kJ/mol | CIDT | Rodgers, 2001, 2 | RCD |
By formula: K+ + C7H8O = (K+ • C7H8O)
Quantity | Value | Units | Method | Reference | Comment |
---|---|---|---|---|---|
ΔrH° | 79. ± 3. | kJ/mol | CIDT | Amunugama and Rodgers, 2003 | RCD |
By formula: (K+ • C7H8O) + C7H8O = (K+ • 2C7H8O)
Quantity | Value | Units | Method | Reference | Comment |
---|---|---|---|---|---|
ΔrH° | 70. ± 3. | kJ/mol | CIDT | Amunugama and Rodgers, 2003 | RCD |
By formula: K+ + C7H8 = (K+ • C7H8)
Quantity | Value | Units | Method | Reference | Comment |
---|---|---|---|---|---|
ΔrH° | 79.9 ± 5.0 | kJ/mol | CIDT | Amunugama and Rodgers, 2002, 3 | RCD |
By formula: (K+ • C7H8) + C7H8 = (K+ • 2C7H8)
Quantity | Value | Units | Method | Reference | Comment |
---|---|---|---|---|---|
ΔrH° | 74.9 ± 4.6 | kJ/mol | CIDT | Amunugama and Rodgers, 2002, 3 | RCD |
By formula: K+ + C8H16O4 = (K+ • C8H16O4)
Quantity | Value | Units | Method | Reference | Comment |
---|---|---|---|---|---|
ΔrH° | 189. ± 12. | kJ/mol | CIDT | Rodgers and Armentrout, 2000 | RCD |
By formula: K+ + C10H20O5 = (K+ • C10H20O5)
Quantity | Value | Units | Method | Reference | Comment |
---|---|---|---|---|---|
ΔrH° | 205. ± 15. | kJ/mol | CIDT | Rodgers and Armentrout, 2000 | RCD |
By formula: K+ + C12H24O6 = (K+ • C12H24O6)
Quantity | Value | Units | Method | Reference | Comment |
---|---|---|---|---|---|
ΔrH° | 235. ± 13. | kJ/mol | CIDT | Rodgers and Armentrout, 2000 | RCD |
By formula: K+ + ClK = (K+ • ClK)
Quantity | Value | Units | Method | Reference | Comment |
---|---|---|---|---|---|
ΔrH° | 172. | kJ/mol | MS | Chupka, 1959 | gas phase; Knudsen cell; M |
Quantity | Value | Units | Method | Reference | Comment |
ΔrS° | 82.0 | J/mol*K | MS | Chupka, 1959 | gas phase; Knudsen cell; M |
By formula: K+ + H2O = (K+ • H2O)
Quantity | Value | Units | Method | Reference | Comment |
---|---|---|---|---|---|
ΔrH° | 70.7 | kJ/mol | HPMS | Davidson and Kebarle, 1976 | gas phase; M |
ΔrH° | 70. ± 10. | kJ/mol | HPMS | Blades, Jayaweera, et al., 1990 | gas phase; electospray, Entropy change calculated or estimated; M |
ΔrH° | 81. ± 10. | kJ/mol | MS | Burdett and Hayhurst, 1982 | gas phase; flame source, about 1600 K; M |
ΔrH° | 74.9 | kJ/mol | HPMS | Searles and Kebarle, 1969 | gas phase; M |
Quantity | Value | Units | Method | Reference | Comment |
ΔrS° | 83.3 | J/mol*K | HPMS | Davidson and Kebarle, 1976 | gas phase; M |
ΔrS° | 96. | J/mol*K | N/A | Blades, Jayaweera, et al., 1990 | gas phase; electospray, Entropy change calculated or estimated; M |
ΔrS° | 89.1 | J/mol*K | MS | Burdett and Hayhurst, 1982 | gas phase; flame source, about 1600 K; M |
ΔrS° | 90.4 | J/mol*K | HPMS | Searles and Kebarle, 1969 | gas phase; M |
Free energy of reaction
ΔrG° (kJ/mol) | T (K) | Method | Reference | Comment |
---|---|---|---|---|
38. | 300. | HPMS | Blades, Jayaweera, et al., 1990 | gas phase; electospray, Entropy change calculated or estimated; M |
2. | 840. | MS | Chupka, 1959 | gas phase; Knudsen cell, 840+-50K; M |
By formula: (K+ • H2O) + CH4O = (K+ • CH4O • H2O)
Quantity | Value | Units | Method | Reference | Comment |
---|---|---|---|---|---|
ΔrH° | 82.0 | kJ/mol | HPMS | Evans and Keesee, 1991 | gas phase; M |
Quantity | Value | Units | Method | Reference | Comment |
ΔrS° | 136. | J/mol*K | HPMS | Evans and Keesee, 1991 | gas phase; M |
By formula: (K+ • 2H2O) + CH4O = (K+ • CH4O • 2H2O)
Quantity | Value | Units | Method | Reference | Comment |
---|---|---|---|---|---|
ΔrH° | 69.5 | kJ/mol | HPMS | Evans and Keesee, 1991 | gas phase; switching reaction,n(K+)3H2O; M |
Quantity | Value | Units | Method | Reference | Comment |
ΔrS° | 129. | J/mol*K | HPMS | Evans and Keesee, 1991 | gas phase; switching reaction,n(K+)3H2O; M |
By formula: (K+ • H2O • CH4O) + H2O = (K+ • 2H2O • CH4O)
Quantity | Value | Units | Method | Reference | Comment |
---|---|---|---|---|---|
ΔrH° | 54.8 | kJ/mol | HPMS | Evans and Keesee, 1991 | gas phase; M |
Quantity | Value | Units | Method | Reference | Comment |
ΔrS° | 94.6 | J/mol*K | HPMS | Evans and Keesee, 1991 | gas phase; M |
By formula: (K+ • H2O) + C6H6 = (K+ • C6H6 • H2O)
Quantity | Value | Units | Method | Reference | Comment |
---|---|---|---|---|---|
ΔrH° | 70.3 | kJ/mol | HPMS | Sunner, Nishizawa, et al., 1981 | gas phase; switching reaction(K+)2H2O; Searles and Kebarle, 1969; M |
Quantity | Value | Units | Method | Reference | Comment |
ΔrS° | 113. | J/mol*K | HPMS | Sunner, Nishizawa, et al., 1981 | gas phase; switching reaction(K+)2H2O; Searles and Kebarle, 1969; M |
By formula: (K+ • 2H2O) + C6H6 = (K+ • C6H6 • 2H2O)
Quantity | Value | Units | Method | Reference | Comment |
---|---|---|---|---|---|
ΔrH° | 56.1 | kJ/mol | HPMS | Sunner, Nishizawa, et al., 1981 | gas phase; switching reaction(K+)3H2O; Searles and Kebarle, 1969; M |
Quantity | Value | Units | Method | Reference | Comment |
ΔrS° | 102. | J/mol*K | HPMS | Sunner, Nishizawa, et al., 1981 | gas phase; switching reaction(K+)3H2O; Searles and Kebarle, 1969; M |
By formula: (K+ • 3H2O) + C6H6 = (K+ • C6H6 • 3H2O)
Quantity | Value | Units | Method | Reference | Comment |
---|---|---|---|---|---|
ΔrH° | 52.7 | kJ/mol | HPMS | Sunner, Nishizawa, et al., 1981 | gas phase; switching reaction(K+)4H2O; Searles and Kebarle, 1969; M |
Quantity | Value | Units | Method | Reference | Comment |
ΔrS° | 115. | J/mol*K | HPMS | Sunner, Nishizawa, et al., 1981 | gas phase; switching reaction(K+)4H2O; Searles and Kebarle, 1969; M |
By formula: (K+ • H2O • C6H6) + H2O = (K+ • 2H2O • C6H6)
Quantity | Value | Units | Method | Reference | Comment |
---|---|---|---|---|---|
ΔrH° | 53.1 | kJ/mol | HPMS | Sunner, Nishizawa, et al., 1981 | gas phase; From thermochemical cycle,switching reaction(K+)3H2O; Searles and Kebarle, 1969; M |
Quantity | Value | Units | Method | Reference | Comment |
ΔrS° | 89.5 | J/mol*K | HPMS | Sunner, Nishizawa, et al., 1981 | gas phase; From thermochemical cycle,switching reaction(K+)3H2O; Searles and Kebarle, 1969; M |
By formula: (K+ • H2O • 2C6H6) + H2O = (K+ • 2H2O • 2C6H6)
Quantity | Value | Units | Method | Reference | Comment |
---|---|---|---|---|---|
ΔrH° | 51.0 | kJ/mol | HPMS | Sunner, Nishizawa, et al., 1981 | gas phase; From thermochemical cycle(K+ 3H2O)C6H6; Searles and Kebarle, 1969; M |
Quantity | Value | Units | Method | Reference | Comment |
ΔrS° | 123. | J/mol*K | HPMS | Sunner, Nishizawa, et al., 1981 | gas phase; From thermochemical cycle(K+ 3H2O)C6H6; Searles and Kebarle, 1969; M |
By formula: (K+ • 2H2O • C6H6) + H2O = (K+ • 3H2O • C6H6)
Quantity | Value | Units | Method | Reference | Comment |
---|---|---|---|---|---|
ΔrH° | 49.4 | kJ/mol | HPMS | Sunner, Nishizawa, et al., 1981 | gas phase; From thermochemical cycle,switching reaction(K+)4H2O; Searles and Kebarle, 1969; M |
Quantity | Value | Units | Method | Reference | Comment |
ΔrS° | 110. | J/mol*K | HPMS | Sunner, Nishizawa, et al., 1981 | gas phase; From thermochemical cycle,switching reaction(K+)4H2O; Searles and Kebarle, 1969; M |
By formula: (K+ • H2O) + H2O = (K+ • 2H2O)
Quantity | Value | Units | Method | Reference | Comment |
---|---|---|---|---|---|
ΔrH° | 70. ± 10. | kJ/mol | HPMS | Blades, Jayaweera, et al., 1990 | gas phase; electospray, Entropy change calculated or estimated; M |
ΔrH° | 67.4 | kJ/mol | HPMS | Searles and Kebarle, 1969 | gas phase; M |
Quantity | Value | Units | Method | Reference | Comment |
ΔrS° | 96. | J/mol*K | N/A | Blades, Jayaweera, et al., 1990 | gas phase; electospray, Entropy change calculated or estimated; M |
ΔrS° | 101. | J/mol*K | HPMS | Searles and Kebarle, 1969 | gas phase; M |
Free energy of reaction
ΔrG° (kJ/mol) | T (K) | Method | Reference | Comment |
---|---|---|---|---|
38. | 300. | HPMS | Blades, Jayaweera, et al., 1990 | gas phase; electospray, Entropy change calculated or estimated; M |
By formula: (K+ • 2H2O) + H2O = (K+ • 3H2O)
Quantity | Value | Units | Method | Reference | Comment |
---|---|---|---|---|---|
ΔrH° | 54.4 | kJ/mol | ES/HPMS | Blades, Klassen, et al., 1996 | gas phase; M |
ΔrH° | 60. ± 10. | kJ/mol | HPMS | Blades, Jayaweera, et al., 1990 | gas phase; electospray, Entropy change calculated or estimated; M |
ΔrH° | 55.2 | kJ/mol | HPMS | Searles and Kebarle, 1969 | gas phase; M |
Quantity | Value | Units | Method | Reference | Comment |
ΔrS° | 94.1 | J/mol*K | ES/HPMS | Blades, Klassen, et al., 1996 | gas phase; M |
ΔrS° | 96. | J/mol*K | N/A | Blades, Jayaweera, et al., 1990 | gas phase; electospray, Entropy change calculated or estimated; M |
ΔrS° | 96.2 | J/mol*K | HPMS | Searles and Kebarle, 1969 | gas phase; M |
Quantity | Value | Units | Method | Reference | Comment |
ΔrG° | 26. | kJ/mol | ES/HPMS | Blades, Klassen, et al., 1996 | gas phase; M |
Free energy of reaction
ΔrG° (kJ/mol) | T (K) | Method | Reference | Comment |
---|---|---|---|---|
28. | 300. | HPMS | Blades, Jayaweera, et al., 1990 | gas phase; electospray, Entropy change calculated or estimated; M |
By formula: (K+ • 3H2O) + H2O = (K+ • 4H2O)
Quantity | Value | Units | Method | Reference | Comment |
---|---|---|---|---|---|
ΔrH° | 50. ± 10. | kJ/mol | HPMS | Blades, Jayaweera, et al., 1990 | gas phase; electospray, Entropy change calculated or estimated; M |
ΔrH° | 49.4 | kJ/mol | HPMS | Searles and Kebarle, 1969 | gas phase; M |
Quantity | Value | Units | Method | Reference | Comment |
ΔrS° | 96. | J/mol*K | N/A | Blades, Jayaweera, et al., 1990 | gas phase; electospray, Entropy change calculated or estimated; M |
ΔrS° | 103. | J/mol*K | HPMS | Searles and Kebarle, 1969 | gas phase; M |
Free energy of reaction
ΔrG° (kJ/mol) | T (K) | Method | Reference | Comment |
---|---|---|---|---|
25. | 300. | HPMS | Blades, Jayaweera, et al., 1990 | gas phase; electospray, Entropy change calculated or estimated; M |
By formula: (K+ • 4H2O) + H2O = (K+ • 5H2O)
Quantity | Value | Units | Method | Reference | Comment |
---|---|---|---|---|---|
ΔrH° | 44.8 | kJ/mol | HPMS | Searles and Kebarle, 1969 | gas phase; M |
Quantity | Value | Units | Method | Reference | Comment |
ΔrS° | 105. | J/mol*K | HPMS | Searles and Kebarle, 1969 | gas phase; M |
By formula: (K+ • 5H2O) + H2O = (K+ • 6H2O)
Quantity | Value | Units | Method | Reference | Comment |
---|---|---|---|---|---|
ΔrH° | 41.8 | kJ/mol | HPMS | Searles and Kebarle, 1969 | gas phase; M |
Quantity | Value | Units | Method | Reference | Comment |
ΔrS° | 108. | J/mol*K | HPMS | Searles and Kebarle, 1969 | gas phase; M |
By formula: K+ + H2 = (K+ • H2)
Quantity | Value | Units | Method | Reference | Comment |
---|---|---|---|---|---|
ΔrH° | 7.78 | kJ/mol | SIDT | Bushnell, Kemper, et al., 1994 | gas phase; ΔrH(0K) = 6.07 kJ/mol; M |
Quantity | Value | Units | Method | Reference | Comment |
ΔrS° | 56.5 | J/mol*K | SIDT | Bushnell, Kemper, et al., 1994 | gas phase; ΔrH(0K) = 6.07 kJ/mol; M |
By formula: (K+ • H2) + H2 = (K+ • 2H2)
Quantity | Value | Units | Method | Reference | Comment |
---|---|---|---|---|---|
ΔrH° | 6.15 | kJ/mol | SIDT | Bushnell, Kemper, et al., 1994 | gas phase; ΔrH(0K) = 5.65 kJ/mol; M |
Quantity | Value | Units | Method | Reference | Comment |
ΔrS° | 46.9 | J/mol*K | SIDT | Bushnell, Kemper, et al., 1994 | gas phase; ΔrH(0K) = 5.65 kJ/mol; M |
By formula: K+ + H3N = (K+ • H3N)
Quantity | Value | Units | Method | Reference | Comment |
---|---|---|---|---|---|
ΔrH° | 84.1 | kJ/mol | HPMS | Castleman, 1978 | gas phase; M |
ΔrH° | 74.5 | kJ/mol | HPMS | Davidson and Kebarle, 1976, 2 | gas phase; M |
Quantity | Value | Units | Method | Reference | Comment |
ΔrS° | 96.2 | J/mol*K | HPMS | Castleman, 1978 | gas phase; M |
ΔrS° | 117. | J/mol*K | HPMS | Davidson and Kebarle, 1976, 2 | gas phase; M |
By formula: (K+ • H3N) + H3N = (K+ • 2H3N)
Quantity | Value | Units | Method | Reference | Comment |
---|---|---|---|---|---|
ΔrH° | 68.2 | kJ/mol | HPMS | Castleman, 1978 | gas phase; M |
Quantity | Value | Units | Method | Reference | Comment |
ΔrS° | 95.4 | J/mol*K | HPMS | Castleman, 1978 | gas phase; M |
By formula: (K+ • 2H3N) + H3N = (K+ • 3H3N)
Quantity | Value | Units | Method | Reference | Comment |
---|---|---|---|---|---|
ΔrH° | 56.5 | kJ/mol | HPMS | Castleman, 1978 | gas phase; M |
Quantity | Value | Units | Method | Reference | Comment |
ΔrS° | 116. | J/mol*K | HPMS | Castleman, 1978 | gas phase; M |
By formula: (K+ • 3H3N) + H3N = (K+ • 4H3N)
Quantity | Value | Units | Method | Reference | Comment |
---|---|---|---|---|---|
ΔrH° | 48.5 | kJ/mol | HPMS | Castleman, 1978 | gas phase; M |
Quantity | Value | Units | Method | Reference | Comment |
ΔrS° | 106. | J/mol*K | HPMS | Castleman, 1978 | gas phase; M |
By formula: K+ + He = (K+ • He)
Quantity | Value | Units | Method | Reference | Comment |
---|---|---|---|---|---|
ΔrH° | 2.4 | kJ/mol | SCATTERING | Gislason, 1984 | gas phase; M |
ΔrH° | 2.2 | kJ/mol | IMob | Viehland, 1984 | gas phase; M |
ΔrH° | 2.2 | kJ/mol | IMob | Takebe, 1983 | gas phase; M |
ΔrH° | 2.4 | kJ/mol | IMob | Robson and Kumar, 1973 | gas phase; M |
By formula: (K+ • 2K) + K = (K+ • 3K)
Quantity | Value | Units | Method | Reference | Comment |
---|---|---|---|---|---|
ΔrH° | 43.5 | kJ/mol | PDiss | Brechignac, Cahuzac, et al., 1990 | gas phase; M |
By formula: (K+ • 3K) + K = (K+ • 4K)
Quantity | Value | Units | Method | Reference | Comment |
---|---|---|---|---|---|
ΔrH° | 64.9 | kJ/mol | PDiss | Brechignac, Cahuzac, et al., 1990 | gas phase; M |
By formula: (K+ • 4K) + K = (K+ • 5K)
Quantity | Value | Units | Method | Reference | Comment |
---|---|---|---|---|---|
ΔrH° | 52.3 | kJ/mol | PDiss | Brechignac, Cahuzac, et al., 1990 | gas phase; M |
By formula: (K+ • 5K) + K = (K+ • 6K)
Quantity | Value | Units | Method | Reference | Comment |
---|---|---|---|---|---|
ΔrH° | 72.4 | kJ/mol | PDiss | Brechignac, Cahuzac, et al., 1990 | gas phase; M |
By formula: (K+ • 6K) + K = (K+ • 7K)
Quantity | Value | Units | Method | Reference | Comment |
---|---|---|---|---|---|
ΔrH° | 56.1 | kJ/mol | PDiss | Brechignac, Cahuzac, et al., 1990 | gas phase; M |
By formula: (K+ • 7K) + K = (K+ • 8K)
Quantity | Value | Units | Method | Reference | Comment |
---|---|---|---|---|---|
ΔrH° | 87.0 | kJ/mol | PDiss | Brechignac, Cahuzac, et al., 1990 | gas phase; M |
By formula: (K+ • 8K) + K = (K+ • 9K)
Quantity | Value | Units | Method | Reference | Comment |
---|---|---|---|---|---|
ΔrH° | 48.1 | kJ/mol | PDiss | Brechignac, Cahuzac, et al., 1990 | gas phase; M |
By formula: (K+ • 9K) + K = (K+ • 10K)
Quantity | Value | Units | Method | Reference | Comment |
---|---|---|---|---|---|
ΔrH° | 54.8 | kJ/mol | PDiss | Brechignac, Cahuzac, et al., 1990 | gas phase; M |
By formula: (K+ • 10K) + K = (K+ • 11K)
Quantity | Value | Units | Method | Reference | Comment |
---|---|---|---|---|---|
ΔrH° | 54.0 | kJ/mol | PDiss | Brechignac, Cahuzac, et al., 1990 | gas phase; M |
By formula: (K+ • 11K) + K = (K+ • 12K)
Quantity | Value | Units | Method | Reference | Comment |
---|---|---|---|---|---|
ΔrH° | 56.1 | kJ/mol | PDiss | Brechignac, Cahuzac, et al., 1990 | gas phase; M |
By formula: (K+ • 12K) + K = (K+ • 13K)
Quantity | Value | Units | Method | Reference | Comment |
---|---|---|---|---|---|
ΔrH° | 56.1 | kJ/mol | PDiss | Brechignac, Cahuzac, et al., 1990 | gas phase; M |
By formula: (K+ • 13K) + K = (K+ • 14K)
Quantity | Value | Units | Method | Reference | Comment |
---|---|---|---|---|---|
ΔrH° | 62.3 | kJ/mol | PDiss | Brechignac, Cahuzac, et al., 1990 | gas phase; M |
By formula: (K+ • 14K) + K = (K+ • 15K)
Quantity | Value | Units | Method | Reference | Comment |
---|---|---|---|---|---|
ΔrH° | 54.8 | kJ/mol | PDiss | Brechignac, Cahuzac, et al., 1990 | gas phase; M |
By formula: (K+ • 15K) + K = (K+ • 16K)
Quantity | Value | Units | Method | Reference | Comment |
---|---|---|---|---|---|
ΔrH° | 62.8 | kJ/mol | PDiss | Brechignac, Cahuzac, et al., 1990 | gas phase; M |
By formula: (K+ • 16K) + K = (K+ • 17K)
Quantity | Value | Units | Method | Reference | Comment |
---|---|---|---|---|---|
ΔrH° | 64.9 | kJ/mol | PDiss | Brechignac, Cahuzac, et al., 1990 | gas phase; M |
By formula: (K+ • 17K) + K = (K+ • 18K)
Quantity | Value | Units | Method | Reference | Comment |
---|---|---|---|---|---|
ΔrH° | 67.4 | kJ/mol | PDiss | Brechignac, Cahuzac, et al., 1990 | gas phase; M |
By formula: (K+ • 18K) + K = (K+ • 19K)
Quantity | Value | Units | Method | Reference | Comment |
---|---|---|---|---|---|
ΔrH° | 65.7 | kJ/mol | PDiss | Brechignac, Cahuzac, et al., 1990 | gas phase; M |
By formula: (K+ • 19K) + K = (K+ • 20K)
Quantity | Value | Units | Method | Reference | Comment |
---|---|---|---|---|---|
ΔrH° | 72.4 | kJ/mol | PDiss | Brechignac, Cahuzac, et al., 1990 | gas phase; M |
By formula: (K+ • 20K) + K = (K+ • 21K)
Quantity | Value | Units | Method | Reference | Comment |
---|---|---|---|---|---|
ΔrH° | 54.0 | kJ/mol | PDiss | Brechignac, Cahuzac, et al., 1990 | gas phase; M |
By formula: (K+ • 21K) + K = (K+ • 22K)
Quantity | Value | Units | Method | Reference | Comment |
---|---|---|---|---|---|
ΔrH° | 59.8 | kJ/mol | PDiss | Brechignac, Cahuzac, et al., 1990 | gas phase; M |
By formula: (K+ • 22K) + K = (K+ • 23K)
Quantity | Value | Units | Method | Reference | Comment |
---|---|---|---|---|---|
ΔrH° | 56.9 | kJ/mol | PDiss | Brechignac, Cahuzac, et al., 1990 | gas phase; M |
By formula: (K+ • 23K) + K = (K+ • 24K)
Quantity | Value | Units | Method | Reference | Comment |
---|---|---|---|---|---|
ΔrH° | 61.9 | kJ/mol | PDiss | Brechignac, Cahuzac, et al., 1990 | gas phase; M |
By formula: K+ + K2O4S = (K+ • K2O4S)
Quantity | Value | Units | Method | Reference | Comment |
---|---|---|---|---|---|
ΔrH° | 160. | kJ/mol | MS | Kudin, Gusarov, et al., 1973 | gas phase; Knudsen cell; M |
By formula: K+ + Kr = (K+ • Kr)
Quantity | Value | Units | Method | Reference | Comment |
---|---|---|---|---|---|
ΔrH° | 13.4 | kJ/mol | IMob | Gatland, 1984 | gas phase; M |
ΔrH° | 12.1 | kJ/mol | SCATTERING | Gislason, 1984 | gas phase; M |
ΔrH° | 12.3 | kJ/mol | IMob | Viehland, 1984 | gas phase; M |
ΔrH° | 15.5 | kJ/mol | IMob | Takebe, 1983 | gas phase; M |
By formula: K+ + N2 = (K+ • N2)
Free energy of reaction
ΔrG° (kJ/mol) | T (K) | Method | Reference | Comment |
---|---|---|---|---|
4.2 | 310. | DT | Beyer and Keller, 1971 | gas phase; low E/N; M |
By formula: K+ + Ne = (K+ • Ne)
Quantity | Value | Units | Method | Reference | Comment |
---|---|---|---|---|---|
ΔrH° | 4.56 | kJ/mol | SCATTERING | Gislason, 1984 | gas phase; M |
ΔrH° | 3.8 | kJ/mol | IMob | Viehland, 1984 | gas phase; M |
ΔrH° | 4.0 | kJ/mol | IMob | Takebe, 1983 | gas phase; M |
ΔrH° | 4.1 | kJ/mol | IMob | Robson and Kumar, 1973 | gas phase; M |
By formula: K+ + Xe = (K+ • Xe)
Quantity | Value | Units | Method | Reference | Comment |
---|---|---|---|---|---|
ΔrH° | 18.0 | kJ/mol | IMob | Gatland, 1984 | gas phase; M |
ΔrH° | 15.8 | kJ/mol | SCATTERING | Gislason, 1984 | gas phase; M |
ΔrH° | 20.3 | kJ/mol | IMob | Viehland, 1984 | gas phase; M |
ΔrH° | 22.3 | kJ/mol | IMob | Takebe, 1983 | gas phase; M |

Gas phase thermochemistry data

Quantity Value Units Method Reference Comment
gas,1 bar154.58J/mol*KReviewChase, 1998Data last reviewed in December, 1983

References

Davidson and Kebarle, 1976
Davidson, W.R.; Kebarle, P.,
Ionic Solvation by Aprotic Solvents. Gas Phase Solvation of the Alkali Ions by Acetonitrile,
J. Am. Chem. Soc., 1976, 98, 20, 6125, https://doi.org/10.1021/ja00436a010
. [all data]
Blades, Jayaweera, et al., 1990
Blades, A.T.; Jayaweera, P.; Ikonomou, M.G.; Kebarle, P.,
Studies of Alkaline - Earth and Transition - Metal M++ Gas - Phase Ion Chemistry,
J. Chem. Phys., 1990, 92, 10, 5900, https://doi.org/10.1063/1.458360
. [all data]
Burdett and Hayhurst, 1982
Burdett, N.A.; Hayhurst, A.N.,
Hydration of gas phase ions and the measurement of boundary layer cooling during flame sampling into a mass spectrometer.,
J. Chem. Soc. Faraday Trans. 1, 1982, 78, 2997. [all data]
Searles and Kebarle, 1969
Searles, S.K.; Kebarle, P.,
Hydration of the Potassium Ion in the Gas Phase: Enthalpies and Entropies of Hydration Reactions K+(H2O)n-1 + H2O = K+(H2O)n for n=1 to n=6,
Can. J. Chem., 1969, 47, 14, 2619, https://doi.org/10.1139/v69-432
. [all data]
Chupka, 1959
Chupka, W.A.,
Dissociation Energies of Some Gaseous Halide Complex Ions and the Hydrated Ion K(H2O)+,
J. Chem. Phys., 1959, 40, 2, 458, https://doi.org/10.1063/1.1729974
. [all data]
Blades, Klassen, et al., 1996
Blades, A.T.; Klassen, J.S.; Kebarle, P.,
Determination of Ion-Solvent Equilibria in the Gas Phase. Hydration of Diprotonated Diamines and Bis(trimethylammonium) Alkanes,
J. Am. Chem. Soc., 1996, 118, 49, 12437, https://doi.org/10.1021/ja962641t
. [all data]
Davidson and Kebarle, 1976, 2
Davidson, W.R.; Kebarle, P.,
Binding Energies and Stabilities of Potassium Ion Complexes from Studies of Gas Phase Ion Equilibria K+ + M = K+.M,
J. Am. Chem. Soc., 1976, 98, 20, 6133, https://doi.org/10.1021/ja00436a011
. [all data]
Sunner, Nishizawa, et al., 1981
Sunner, J.; Nishizawa, K.; Kebarle, P.,
Ion - Solvent Molecule Interactions in the Gas Phase. Potassium Ion and Benzene,
J. Phys. Chem., 1981, 85, 13, 1814, https://doi.org/10.1021/j150613a011
. [all data]
Rodgers and Armentrout, 2000
Rodgers, M.T.; Armentrout, P.B.,
Noncovalent Metal-Ligand Bond Energies as Studied by Threshold Collision-Induced Dissociation,
Mass Spectrom. Rev., 2000, 19, 4, 215, https://doi.org/10.1002/1098-2787(200007)19:4<215::AID-MAS2>3.0.CO;2-X
. [all data]
Davidson and Kebarle, 1976, 3
Davidson, W.R.; Kebarle, P.,
Binding Energies and Stabilities of Potassium Ion Complexes with Ethylene Diamine and Dimethoxyethane (Glyme) from Measurements of the Complexing Equilibria in the Gas Phase,
Can. J. Chem., 1976, 54, 16, 2594, https://doi.org/10.1139/v76-368
. [all data]
Castleman, 1978
Castleman, A.W.,
The Properties of Clusters in the Gas Phase: Ammonia about Bi+, Rb+, and K+,
Chem. Phys. Lett., 1978, 53, 3, 560, https://doi.org/10.1016/0009-2614(78)80069-4
. [all data]
Gatland, 1984
Gatland, I.R.,
Swarms of Ions and Electrons in Gases, W. Lindinger, T. D. Mark and F. Howorka, eds. (Springer, New York, 1984, 1984, 44. [all data]
Gislason, 1984
Gislason, E.A.,
Quoted in I. R. Gatland in Swarms of Ions and Electrons in Gases, W. Lindinger, T. D. Mark and F. Howorka, eds. (Springer, New York, 1984, 1984, 44. [all data]
Viehland, 1984
Viehland, L.A.,
Interaction Potentials for Li+ - Rare - Gas Systems,
Chem. Phys., 1984, 78, 2, 279, https://doi.org/10.1016/0301-0104(83)85114-3
. [all data]
Takebe, 1983
Takebe, M.,
The Generalized Mobility Curve for Alkali Ions in Rare Gases: Clustering Reactions and Mobility Curves,
J. Chem. Phys., 1983, 78, 12, 7223, https://doi.org/10.1063/1.444763
. [all data]
Robson and Kumar, 1973
Robson, R.E.; Kumar, K.,
Mobility and Diffusion II. Dependence on Experimental Variables and Interaction Potential for Alkali Ions in Rare Gases,
Aust. J. Phys., 1973, 26, 2, 187, https://doi.org/10.1071/PH730187
. [all data]
Kudin, Gusarov, et al., 1973
Kudin, L.S.; Gusarov, A.V.; Gorokhov, L.N.,
Mass Spectrometer Study of Equilibria Involving Ions. 1. Potassium Bromide and Sulfate,
High Temp., 1973, 11, 50. [all data]
Castleman and Keesee, 1981
Castleman, A.W.; Keesee, R.G.,
Electron and Ion Swarms,
Proc. Second Int. Swarm Seminar, L. G. Christoforou, ed. (Pergamon Press, New York), 1981, 189-201. [all data]
Keller and Beyer, 1971
Keller, G.E.; Beyer, R.A.,
Drift Tube Studies of Carbon Dioxide Clustering to Potassium and Sodium Ions,
Bull. Am. Phys. Soc., 1971, 16, 214. [all data]
Bushnell, Kemper, et al., 1994
Bushnell, J.E.; Kemper, P.R.; Bowers, M.T.,
Na+/K+(H2)1,2 clusters: experiment,
J. Phys. Chem., 1994, 98, 8, 2044, https://doi.org/10.1021/j100059a011
. [all data]
Evans and Keesee, 1991
Evans, D.H.; Keesee, R.G.,
Thermodynamics of Gas-Phase Mixed-Solvent Cluster Ions - Water and Methanol on K+ and Cl- and Comparison to Liquid Solutions,
J. Phys. Chem., 1991, 95, 9, 3558, https://doi.org/10.1021/j100162a024
. [all data]
Sunner, 1984
Sunner, J. Kebarle,
Ion - Solvent Molecule Interactions in the Gas Phase. The Potassium Ion and Me2SO, DMA, DMF, and Acetone,
J. Am. Chem. Soc., 1984, 106, 21, 6135, https://doi.org/10.1021/ja00333a002
. [all data]
Blades, Klassen, et al., 1995
Blades, A.T.; Klassen, J.S.; Kebarle, P.,
Free Energies of Hydration in the Gas Phase on the Anions of Some Oxo Acids of C, N, S, P, Cl and I,
J. Am. Chem. Soc., 1995, 117, 42, 10563, https://doi.org/10.1021/ja00147a019
. [all data]
Amicangelo and Armentrout, 2000
Amicangelo, J.C.; Armentrout, P.B.,
Absolute Binding Energies of Alkali-Metal Cation Complexes with Benzene Determined by Threshold Collision-Induced Dissociation Experiments and Ab Initio Theory,
J. Phys. Chem. A, 2000, 104, 48, 11420, https://doi.org/10.1021/jp002652f
. [all data]
Amunugama and Rodgers, 2000
Amunugama, R.; Rodgers, M.T.,
Absolute Alkali Metal Ion Binding Affinities of Several Azines Determined by Threshold Collision-Induced Dissociation and Ab Initio Theory,
Int. J. Mass Spectrom., 2000, 195/196, 439, https://doi.org/10.1016/S1387-3806(99)00145-1
. [all data]
Klassen, Anderson, et al., 1996
Klassen, J.S.; Anderson, S.G.; Blades, A.T.; Kebarle, P.,
Reaction Enthalpies for M+L = M+ + L, Where M+ = Na+ and K+ and L = Acetamide, N-Methylacetamide, N,N-Dimethylacetamide, Glycine, and Glycylglycine, from Determinations of the Collision-Induced Dissociation Thresholds,
J. Phys. Chem., 1996, 100, 33, 14218, https://doi.org/10.1021/jp9608382
. [all data]
Huang and Rodgers, 2002
Huang, H.; Rodgers, M.T.,
Sigma versus Pi interactions in alkali metal ion binding to azoles: Threshold collision-induced dissociation and ab initio theory studies,
J. Phys. Chem. A, 2002, 106, 16, 4277, https://doi.org/10.1021/jp013630b
. [all data]
Cerda and Wesdemiotis, 1996
Cerda, B.A.; Wesdemiotis, C.,
PAs of Peptides,
J. Am. Chem. Soc., 1996, 118, 11884. [all data]
Rodgers, 2001
Rodgers, M.T.,
Substituent Effects in the Binding of Alkali Metal Ions to Pyridines, Studied by Threshold Collision-Induced Dissociation and ab Initio Theory: The Aminopyridines,
J. Phys. Chem. A, 2001, 105, 35, 8145, https://doi.org/10.1021/jp011555z
. [all data]
Amunugama and Rodgers, 2002
Amunugama, R.; Rodgers, M.T.,
Influence of substituents on cation-pi interactions. 2. Absolute binding energies of alkali metal cation-fluorobenzene complexes determined by threshold collision-induced dissociation and theoretical studies,
J. Phys. Chem. A, 2002, 106, 39, 9092, https://doi.org/10.1021/jp020459a
. [all data]
Amunugama and Rodgers, 2002, 2
Amunugama, R.; Rodgers, M.T.,
The influence of substituents on cation-pi interactions. 4. Absolute binding energies of alkali metal cation - Phenol complexes determined by threshold collision-induced dissociation and theoretical studies,
J. Phys. Chem. A, 2002, 106, 42, 9718, https://doi.org/10.1021/jp0211584
. [all data]
Rodgers, 2001, 2
Rodgers, M.T.,
Substituent Effects in the Binding of Alkali Metal Ions to Pyridines, Studied by Threshold Collision-Induced Dissociation and ab Initio Theory: The Methylpyridines,
J. Phys. Chem. A, 2001, 105, 11, 2374, https://doi.org/10.1021/jp004055z
. [all data]
Amunugama and Rodgers, 2003
Amunugama, R.; Rodgers, M.T.,
Influence of substituents on cation-pi interactions - 5. Absolute binding energies of alkali metal cation-anisole complexes determined by threshold collision-induced dissociation and theoretical studies,
Int. J. Mass Spectrom., 2003, 222, 1-3, 431, https://doi.org/10.1016/S1387-3806(02)00945-4
. [all data]
Amunugama and Rodgers, 2002, 3
Amunugama, R.; Rodgers, M.T.,
Influence of substituents on cation-pi interactions. 1. Absolute binding energies of alkali metal cation-toluene complexes determined by threshold collision-induced dissociation and theoretical studies,
J. Phys. Chem. A, 2002, 106, 22, 5529, https://doi.org/10.1021/jp014307b
. [all data]
Brechignac, Cahuzac, et al., 1990
Brechignac, C.; Cahuzac, P.; Carlier, F.; De Frutos, M.; Leyniger, J.,
Cohesive Energies of (K)n+ 5<n<200 from Photoevaporation Experiments,
J. Chem. Phys., 1990, 93, 10, 7449, https://doi.org/10.1063/1.459418
. [all data]
Beyer and Keller, 1971
Beyer, R.A.; Keller, G.E.,
The Clustering of Atmospheric Gases to Alkali Ions,
Trans. Am. Geophys. Union, 1971, 52, 303. [all data]