6-Methyl-5-octen-2-one
- Formula: C9H16O
- Molecular weight: 140.2227
- IUPAC Standard InChIKey: VBXZHAGEYZZDJC-GQCTYLIASA-N
- CAS Registry Number: 24199-46-0
- Chemical structure:
View 3d structure (requires JavaScript / HTML 5) - Other names: 5-Octen-2-one, 6-methyl-; 6-methyloct-5-en-2-one

Phase change data

Data compiled by: Robert L. Brown and Stephen E. Stein
Reduced pressure boiling point
Tboil (K) | Pressure (bar) | Reference |
---|---|---|
358. to 359. | 0.025 | Frinton Laboratories Inc., 1986 |

References

Frinton Laboratories Inc., 1986
Frinton Laboratories Inc.,
Catalog Number 11, Frinton Laboratories Inc., Vineland, NJ, 1986, 99. [all data]