Benzoic acid, 4-(acetylthio)-
- Formula: C9H8O3S
- Molecular weight: 196.223
- IUPAC Standard InChIKey: ZUDCIPNZEZLOLJ-UHFFFAOYSA-N
- CAS Registry Number: 24197-62-4
- Chemical structure:
View 3d structure (requires JavaScript / HTML 5) - Other names: p-Acetylthiobenzoic acid

Reaction thermochemistry data

Data compiled by: Hussein Y. Afeefy, Joel F. Liebman, and Stephen E. Stein
Individual Reactions
By formula: C9H8O3S + H2O = C7H6O2S + C2H4O2
Quantity | Value | Units | Method | Reference | Comment |
---|---|---|---|---|---|
ΔrH° | -11.5 ± 0.4 | kJ/mol | Cm | Nelander, 1964 | solid phase; Heat of hydrolysis |

Van Den Dool and Kratz RI, non-polar column, temperature ramp

Column type | Active phase | I | Reference | Comment |
---|---|---|---|---|
Capillary | VF-5MS | 1748. | Todua, 2011 | 30. m/0.25 mm/0.25 μm, He; Tstart: 60. C; Tend: 270. C |

References

Nelander, 1964
Nelander, L.,
The heats of hydrolysis of aspirin, thioaspirin, and their p-analogues,
Acta Chem. Scand., 1964, 18, 973-984. [all data]
Todua, 2011
Todua, N.G.,
Retention Data. NIST Mass Spectrometry Data Center., NIST Mass Spectrometry Data Center, 2011. [all data]