Phenol, 2,3,6-trimethyl-
- Formula: C9H12O
- Molecular weight: 136.1910
- IUPAC Standard InChIKey: QQOMQLYQAXGHSU-UHFFFAOYSA-N
- CAS Registry Number: 2416-94-6
- Chemical structure:
View 3d structure (requires JavaScript / HTML 5) - Other names: 2,3,6-Trimethylphenol; 1-Hydroxy-2,3,6-trimethylbenzene

Phase change data

Data compiled as indicated in comments:
TRC - Thermodynamics Research Center, NIST Boulder Laboratories, Chris Muzny director
AC - William E. Acree, Jr., James S. Chickos
Quantity | Value | Units | Method | Reference | Comment |
---|---|---|---|---|---|
Tfus | 354.65 | K | N/A | Baglai, Gurarii, et al., 1988 | Uncertainty assigned by TRC = 0.4 K; TRC |
Tfus | 335. | K | N/A | Gubareva, Bulaeva, et al., 1985 | Uncertainty assigned by TRC = 2. K; TRC |
Tfus | 335.15 | K | N/A | Karr, 1957 | Uncertainty assigned by TRC = 2. K; TRC |
Tfus | 335.45 | K | N/A | Sears and Kitchen, 1949 | Uncertainty assigned by TRC = 1. K; TRC |
Quantity | Value | Units | Method | Reference | Comment |
ΔsubH° | 86.7 ± 0.6 | kJ/mol | GS | Verevkin, 1999 | AC |
Enthalpy of vaporization
ΔvapH (kJ/mol) | Temperature (K) | Reference | Comment |
---|---|---|---|
51.1 ± 0.2 | 431. | Baglay, Gurariy, et al., 1988 | Based on data from 359. to 503. K.; AC |
Enthalpy of fusion
ΔfusH (kJ/mol) | Temperature (K) | Reference | Comment |
---|---|---|---|
22.05 | 331.2 | Verevkin, 1999 | AC |

References

Baglai, Gurarii, et al., 1988
Baglai, A.K.; Gurarii, L.L.; Kuleshov, G.G.,
Physical Properties of Compounds Used in Vitamin Synthesis,
J. Chem. Eng. Data, 1988, 33, 512. [all data]
Gubareva, Bulaeva, et al., 1985
Gubareva, A.I.; Bulaeva, N.V.; Gerasimov, P.A.; Gadzhiev, S.N.,
Physicochemical propeties of 2,3,6-trimethylphenol,
Zh. Prikl. Khim. (Leningrad), 1985, 58, 191. [all data]
Karr, 1957
Karr, C.,
, U. S. Bur. Mines, Inform. Circ. IC 7802, 1957. [all data]
Sears and Kitchen, 1949
Sears, W.C.; Kitchen, L.J.,
Infrared Studies of Hindered Phenols,
J. Am. Chem. Soc., 1949, 71, 4110. [all data]
Verevkin, 1999
Verevkin, Sergey P.,
Thermochemistry of phenols: buttress effects in sterically hindered phenols,
The Journal of Chemical Thermodynamics, 1999, 31, 11, 1397-1416, https://doi.org/10.1006/jcht.1999.0466
. [all data]
Baglay, Gurariy, et al., 1988
Baglay, A.K.; Gurariy, L.L.; Kuleshov, G.G.,
Physical properties of compounds used in vitamin synthesis,
J. Chem. Eng. Data, 1988, 33, 512-518. [all data]