Cloxazolam
- Formula: C17H14Cl2N2O2
- Molecular weight: 349.211
- IUPAC Standard InChIKey: ZIXNZOBDFKSQTC-UHFFFAOYSA-N
- CAS Registry Number: 24166-13-0
- Chemical structure:
View 3d structure (requires JavaScript / HTML 5) - Other names: Oxazolo(3,2-d)(1,4)benzodiazepin-6(5H)-one, 10-chloro-11b-(o-chlorophenyl)-2,3,7,11b-tetrahydro-; Cloxazolazepam; CS 370; Enadel; MT 14-411; Olcadil; Sepazon; 10-Chloro-11b-(o-chlorophenyl)-2,3,7,11b-tetrahydro-oxazolo[3,2-d] [1,4]benzodiazepin-6(5H)-one; Betavel; Lubalix; Tolestan; Sepazone

Kovats' RI, non-polar column, custom temperature program

Column type | Active phase | I | Reference | Comment |
---|---|---|---|---|
Capillary | OV-1 | 2405. | Schütz, 1988 | Program: not specified |

Normal alkane RI, non-polar column, temperature ramp

Column type | Active phase | I | Reference | Comment |
---|---|---|---|---|
Packed | SE-30 | 2405. | MHA, 9999 | Nitrogen, Chromosorb G AW DMCS (80-100 mesh); Column length: 2. m; Tstart: 100. C; Tend: 300. C |

References

Schütz, 1988
Schütz, H.,
Modern screening strategies in analytical toxicology with special regard to new benzodiazepines,
Z. Rechtsmed., 1988, 100, 1, 19-37, https://doi.org/10.1007/BF00200362
. [all data]
MHA, 9999
MHA, Directorate of ForensicScience.,
Forensic Toxicology, 9999. [all data]