chromium nitride
- Formula: CrN
- Molecular weight: 66.0028
- IUPAC Standard InChIKey: CXOWYMLTGOFURZ-UHFFFAOYSA-N
- CAS Registry Number: 24094-93-7
- Chemical structure:
View 3d structure (requires JavaScript / HTML 5) - Other names: Chromium(iii) nitride

Gas phase thermochemistry data

Quantity | Value | Units | Method | Reference | Comment |
---|---|---|---|---|---|
ΔfH°gas | 505.01 | kJ/mol | Review | Chase, 1998 | Data last reviewed in December, 1973 |
Quantity | Value | Units | Method | Reference | Comment |
S°gas,1 bar | 230.55 | J/mol*K | Review | Chase, 1998 | Data last reviewed in December, 1973 |
Gas Phase Heat Capacity (Shomate Equation)
Cp° = A + B*t + C*t2 + D*t3 +
E/t2
H° − H°298.15= A*t + B*t2/2 +
C*t3/3 + D*t4/4 − E/t + F − H
S° = A*ln(t) + B*t + C*t2/2 + D*t3/3 −
E/(2*t2) + G
Cp = heat capacity (J/mol*K)
H° = standard enthalpy (kJ/mol)
S° = standard entropy (J/mol*K)
t = temperature (K) / 1000.
View plot Requires a JavaScript / HTML 5 canvas capable browser.
Temperature (K) | 298. to 1300. | 1300. to 6000. |
---|---|---|
A | 24.52150 | 45.83028 |
B | 27.86335 | -6.948578 |
C | -22.40206 | 2.021672 |
D | 6.412357 | -0.144944 |
E | -0.023656 | -5.074690 |
F | 496.5655 | 481.1893 |
G | 252.7236 | 275.0570 |
H | 505.0088 | 505.0088 |
Reference | Chase, 1998 | Chase, 1998 |
Comment | Data last reviewed in December, 1973 | Data last reviewed in December, 1973 |

Condensed phase thermochemistry data

Quantity Value Units Method Reference Comment
Δfsolid-28.000kcal/molReviewChase, 1998Data last reviewed in December, 1973
Quantity Value Units Method Reference Comment
solid9.022cal/mol*KReviewChase, 1998Data last reviewed in December, 1973

Solid Phase Heat Capacity (Shomate Equation)

Cp° = A + B*t + C*t2 + D*t3 + E/t2
H° − H°298.15= A*t + B*t2/2 + C*t3/3 + D*t4/4 − E/t + F − H
S° = A*ln(t) + B*t + C*t2/2 + D*t3/3 − E/(2*t2) + G
    Cp = heat capacity (cal/mol*K)
    H° = standard enthalpy (kcal/mol)
    S° = standard entropy (cal/mol*K)
    t = temperature (K) / 1000.

View plot Requires a JavaScript / HTML 5 canvas capable browser.

View table.

Temperature (K) 298. - 600.600. - 2500.
A -539.235211.13131
B 2516.9931.501788
C -4227.1750.052881
D 2478.561-0.008914
E 9.9018650.001322
F 86.56238-31.40798
G -1172.29721.97027
H -28.00000-28.00000
ReferenceChase, 1998Chase, 1998
Comment Data last reviewed in December, 1973 Data last reviewed in December, 1973

References

Chase, 1998
Chase, M.W., Jr.,
NIST-JANAF Themochemical Tables, Fourth Edition,
J. Phys. Chem. Ref. Data, Monograph 9, 1998, 1-1951. [all data]