2,3,4,6-Tetramethylbenzoic acid
- Formula: C11H14O2
- Molecular weight: 178.2277
- IUPAC Standard InChIKey: CLWNWHIYDPUQMQ-UHFFFAOYSA-N
- CAS Registry Number: 2408-38-0
- Chemical structure:
View 3d structure (requires JavaScript / HTML 5) - Permanent link for this species. Use this link for bookmarking this species for future reference.

Condensed phase thermochemistry data

Data compiled as indicated in comments:
ALS - Hussein Y. Afeefy, Joel F. Liebman, and Stephen E. Stein
DH - Eugene S. Domalski and Elizabeth D. Hearing
Quantity | Value | Units | Method | Reference | Comment |
---|---|---|---|---|---|
ΔfH°solid | -507.8 ± 2.0 | kJ/mol | Cm | Colomina, Jimenez, et al., 1988 | see Colomina, Perez-Ossorio, et al., 1964; ALS |
Constant pressure heat capacity of solid
Cp,solid (J/mol*K) | Temperature (K) | Reference | Comment |
---|---|---|---|
267.3 | 298.15 | Colomina, Jimenez, et al., 1988 | DH |

Gas phase thermochemistry data

Data compiled by: Hussein Y. Afeefy, Joel F. Liebman, and Stephen E. Stein
Quantity | Value | Units | Method | Reference | Comment |
---|---|---|---|---|---|
ΔfH°gas | -398.1 ± 2.1 | kJ/mol | Cm | Colomina, Jimenez, et al., 1988 | see Colomina, Perez-Ossorio, et al., 1964 |

Reaction thermochemistry data

Data compiled by: John E. Bartmess

Individual Reactions

C11H13O2- + Hydrogen cation = 2,3,4,6-Tetramethylbenzoic acid

By formula: C11H13O2- + H+ = C11H14O2

Quantity Value Units Method Reference Comment
Δr1387. ± 8.4kJ/molIMREDecouzon, Gal, et al., 1997gas phase

Phase change data

Data compiled as indicated in comments:
ALS - Hussein Y. Afeefy, Joel F. Liebman, and Stephen E. Stein
DRB - Donald R. Burgess, Jr.
AC - William E. Acree, Jr., James S. Chickos

Quantity Value Units Method Reference Comment
Δsub109.7 ± 0.5kJ/molVColomina, Jimenez, et al., 1988see Colomina, Perez-Ossorio, et al., 1964; ALS
Δsub109.7kJ/molN/AColomina, Jimenez, et al., 1988DRB
Δsub109.7 ± 0.5kJ/molMEColomina, Jimenez, et al., 1988Based on data from 330. - 351. K.; AC

Enthalpy of sublimation

ΔsubH (kJ/mol) Temperature (K) Method Reference Comment
106.9 ± 0.5341.MEColomina, Jimenez, et al., 1988Based on data from 330. - 351. K.; AC

Gas phase ion energetics data

Data compiled by: John E. Bartmess

De-protonation reactions

C11H13O2- + Hydrogen cation = 2,3,4,6-Tetramethylbenzoic acid

By formula: C11H13O2- + H+ = C11H14O2

Quantity Value Units Method Reference Comment
Δr1387. ± 8.4kJ/molIMREDecouzon, Gal, et al., 1997gas phase

References

Colomina, Jimenez, et al., 1988
Colomina, M.; Jimenez, P.; Perez-Ossorio, R.; Roux, M.V.; Turrion, C.,
Thermochemical properties of benzoic acid derivatives. XVI. Vapour pressures and enthalpies of sublimation and formation of the three tetramethylbenzoic acids and of pentamenthylbenzoic acid,
J. Chem. Thermodyn., 1988, 20, 575-580. [all data]
Colomina, Perez-Ossorio, et al., 1964
Colomina, M.; Perez-Ossorio, R.; Turrion, C.; Boned, M.L.; Pedraja, B.,
Investigaciones termoquimicas sobre los acidos alquilbenzoicos,
Anal. Fisc. Quim. B, 1964, 60, 627-638. [all data]