4-(Decyloxy)benzaldehyde
- Formula: C17H26O2
- Molecular weight: 262.3871
- IUPAC Standard InChIKey: WOSYBKJRUQJISL-UHFFFAOYSA-N
- CAS Registry Number: 24083-16-7
- Chemical structure:

Phase change data

Data compiled by: Robert L. Brown and Stephen E. Stein
Reduced pressure boiling point
Tboil (K) | Pressure (bar) | Reference |
---|---|---|
447. to 448. | 0.0005 | Frinton Laboratories Inc., 1986 |

References

Frinton Laboratories Inc., 1986
Frinton Laboratories Inc.,
Catalog Number 11, Frinton Laboratories Inc., Vineland, NJ, 1986, 99. [all data]