Benzaldehyde, 4-(octyloxy)-
- Formula: C15H22O2
- Molecular weight: 234.3340
- IUPAC Standard InChIKey: KVOWZHASDIKNFK-UHFFFAOYSA-N
- CAS Registry Number: 24083-13-4
- Chemical structure:
View 3d structure (requires JavaScript / HTML 5) - Other names: 4-Octyloxybenzaldehyde; p-Octyloxybenzaldehyde; p-n-Octoxy benzaldehyde; 4-n-Octyloxybenzaldehyde; p-n-Octyloxybenzaldehyde

Phase change data

Data compiled by: Robert L. Brown and Stephen E. Stein
Reduced pressure boiling point
Tboil (K) | Pressure (bar) | Reference |
---|---|---|
423. to 424. | 0.001 | Frinton Laboratories Inc., 1986 |

References

Frinton Laboratories Inc., 1986
Frinton Laboratories Inc.,
Catalog Number 11, Frinton Laboratories Inc., Vineland, NJ, 1986, 99. [all data]