Cyclopentanol, 2-methyl-
- Formula: C6H12O
- Molecular weight: 100.1589
- IUPAC Standard InChIKey: BVIJQMCYYASIFP-UHFFFAOYSA-N
- CAS Registry Number: 24070-77-7
- Chemical structure:
View 3d structure (requires JavaScript / HTML 5) - Stereoisomers:
- Other names: 2-Methylcyclopentanol; 2-Methylcyclopentyl alcohol

Condensed phase thermochemistry data

Data compiled by: Hussein Y. Afeefy, Joel F. Liebman, and Stephen E. Stein
Quantity | Value | Units | Method | Reference | Comment |
---|---|---|---|---|---|
ΔcH°liquid | -3744. | kJ/mol | Ccb | Zubova, 1901 | Corresponding ΔfHºliquid = -332. kJ/mol (simple calculation by NIST; no Washburn corrections) |

Phase change data

Data compiled by: Thermodynamics Research Center, NIST Boulder Laboratories, Chris Muzny director
Quantity | Value | Units | Method | Reference | Comment |
---|---|---|---|---|---|
Tboil | 421. | K | N/A | Lutz, Bearse, et al., 1948 | Uncertainty assigned by TRC = 3. K |
Tboil | 424. | K | N/A | Zelinskii, 1897 | Uncertainty assigned by TRC = 6. K |

References

Zubova, 1901
Zubova, P.,
Data about heat of combustion of compound cycle structure,
Zh. Fiz. Khim., 1901, 33, 708-722. [all data]
Lutz, Bearse, et al., 1948
Lutz, G.A.; Bearse, A.E.; Leonard, J.E.; Croxton, F.C.,
Studies in the Methylcyclopentane Series. I. Preparation and Reactions of Methylcyclopentyl Monochlorides,
J. Am. Chem. Soc., 1948, 70, 4135-38. [all data]
Zelinskii, 1897
Zelinskii, N.D.,
Experiments in the Hexamethylene Series,
Ber. Dtsch. Chem. Ges., 1897, 30, 387-91. [all data]